{"text_format":"1","workbook":"xlsx","n_sheets":7,"sheets":["voederbehoeftenormen ","startpagina","vrouwelijk jongvee","zoogkoeien","stieren","lijst voedermiddelen","rekenblad"],"not_rendered":{"charts":0,"images":37,"macros":1,"external_links":0,"defined_names":17,"comments":4,"pivot_tables":0},"unopened":[],"bounds":{"document_bytes":16777216,"sheet_cells":100000,"rows_first":2000,"rows_last":500,"rows_between":2000,"halvings":0,"cell_chars":16384,"cell_head_chars":4096},"cells_cut":0,"cells_raw":0,"read":"whole","date_system":"1900"}

{"sheet":"voederbehoeftenormen ","index":0,"n_rows":116,"n_cols":16,"rows_kept":116,"cut":false,"hidden":true,"merged":[]}
["zoogkoeien",null,null,null,null,null,null,null,null,null,null,null,null,null,"kalving","fysiologische toestand"]
[null,"kalving","fysiologische toestand","VEM","DVE (g)","OEB (g)","Structuur (/kg DS)","Ca (g/kg DS)","P (g/kg DS)","Mg (g)","Na (g)","K (g)",null,null,"1e","niet-zogend"]
[null,"1e","niet-zogend",5473,146,-75,{"$f":"0.6*zoogkoeien!$D$67","v":0},{"$f":"7.6022+(0.9706*zoogkoeien!$D$67)","v":7.6021999999999998},{"$f":"(1.3867*zoogkoeien!$D$67)+1.2236","v":1.2236},8.1,null,null,null,null,"2e","hoogdrachtig (7m)"]
[null,"1e ","hoogdrachtig (7m)",6382.5,258,-75,{"$f":"0.6*zoogkoeien!$D$67","v":0},{"$f":"7.6022+(0.9706*zoogkoeien!$D$67)","v":7.6021999999999998},{"$f":"(1.3867*zoogkoeien!$D$67)+1.2236","v":1.2236},9.1,null,null,null,null,"3e of meer","hoogdrachtig (8m)"]
[null,"1e","hoogdrachtig (8m)",7077.5,339,-75,{"$f":"0.6*zoogkoeien!$D$67","v":0},{"$f":"17.01397+(0.9706*zoogkoeien!$D$67)","v":17.01397},{"$f":"(1.3867*zoogkoeien!$D$67)+6.6903","v":6.6902999999999997},9,null,null,null,null,null,"hoogdrachtig (9m)"]
[null,"1e","hoogdrachtig (9m)",8362.5,446,-75,{"$f":"0.6*zoogkoeien!$D$67","v":0},{"$f":"21.2787+(0.9706*zoogkoeien!$D$67)","v":21.278700000000001},{"$f":"(1.3867*zoogkoeien!$D$67)+8.0236","v":8.0236000000000001},9.5,null,null,null,null,null,"zogend"]
[null,"1e","zogend",8125,458,0,{"$f":"0.7*zoogkoeien!$D$67","v":0},{"$f":"18.1904+(0.9706*zoogkoeien!$D$67)","v":18.1904},{"$f":"(1.08*zoogkoeien!$D$67)+9.2236","v":9.2235999999999994},10.7]
[null,"2e","niet-zogend",5956,154,-94,{"$f":"0.6*zoogkoeien!$D$67","v":0},{"$f":"8.4097+(0.9706*zoogkoeien!$D$67)","v":8.4097000000000008},{"$f":"(1.3867*zoogkoeien!$D$67)+1.1963","v":1.1962999999999999},9.1999999999999993]
[null,"2e","hoogdrachtig (7m)",6866.25,265.5,-94,{"$f":"0.6*zoogkoeien!$D$67","v":0},{"$f":"8.4097+(0.9706*zoogkoeien!$D$67)","v":8.4097000000000008},{"$f":"(1.3867*zoogkoeien!$D$67)+1.1963","v":1.1962999999999999},10.199999999999999]
[null,"2e","hoogdrachtig (8m)",7561.25,346.5,-94,{"$f":"0.6*zoogkoeien!$D$67","v":0},{"$f":"17.8215+(0.9706*zoogkoeien!$D$67)","v":17.8215},{"$f":"(1.3867*zoogkoeien!$D$67)+6.6629","v":6.6628999999999996},10]
[null,"2e","hoogdrachtig (9m)",8846.25,453.5,-94,{"$f":"0.6*zoogkoeien!$D$67","v":0},{"$f":"22.0862+(0.9706*zoogkoeien!$D$67)","v":22.086200000000002},{"$f":"(1.3867*zoogkoeien!$D$67)+7.9963","v":7.9962999999999997},10.5]
[null,"2e","zogend",9050,518,0,{"$f":"0.7*zoogkoeien!$D$67","v":0},{"$f":"20.7626+(0.9706*zoogkoeien!$D$67)","v":20.762599999999999},{"$f":"(1.08*zoogkoeien!$D$67)+10.5296","v":10.5296},12.2]
[null,"3e of meer","niet-zogend",6110,143,-113,{"$f":"0.75*zoogkoeien!$D$67","v":0},{"$f":"7.7715+(0.9706*zoogkoeien!$D$67)","v":7.7714999999999996},{"$f":"(1.3867*zoogkoeien!$D$67)+0.3909","v":0.39090000000000003},10.1]
[null,"3e of meer","hoogdrachtig (7m)",7020,255,-113,{"$f":"0.75*zoogkoeien!$D$67","v":0},{"$f":"7.7715+(0.9706*zoogkoeien!$D$67)","v":7.7714999999999996},{"$f":"(1.3867*zoogkoeien!$D$67)+0.3909","v":0.39090000000000003},11.1]
[null,"3e of meer","hoogdrachtig (8m)",7715,336,-113,{"$f":"0.75*zoogkoeien!$D$67","v":0},{"$f":"17.1832+(0.9706*zoogkoeien!$D$67)","v":17.183199999999999},{"$f":"(1.3867*zoogkoeien!$D$67)+5.8576","v":5.8575999999999997},11]
[null,"3e of meer","hoogdrachtig (9m)",9000,443,-113,{"$f":"0.75*zoogkoeien!$D$67","v":0},{"$f":"21.4479+(0.9706*zoogkoeien!$D$67)","v":21.447900000000001},{"$f":"(1.3867*zoogkoeien!$D$67)+7.1909","v":7.1909000000000001},11.5]
[null,"3e of meer","zogend",9204,507,0,{"$f":"0.75*zoogkoeien!$D$67","v":0},{"$f":"20.1244+(0.9706*zoogkoeien!$D$67)","v":20.124400000000001},{"$f":"(1.08*zoogkoeien!$D$67)+9.7243","v":9.7242999999999995},13.1]
[]
[]
["stieren"]
[]
[null,"Gewicht (kg)","Groei (g/dag)","VEVI","DVE (g)","OEB (g)","Structuur (/kg DS)","Ca (g/kg DS)","P (g/kg DS)","Mg (g)","Na (g/kg DS)","K (g/kg DS)",null,null,"Gewicht (kg)","Groei (g/dag)"]
[null,350,900,6695,388,-25,{"$f":"0.6*stieren!$D$67","v":0},{"$f":"((0.0079*B23+0.66*stieren!$D$67-0.74)+(46.334688*POWER('voederbehoeftenormen '!B23,(-0.22))*C23/1000))*100/68","v":19.880204756608538},{"$f":"((0.83*stieren!$D$67)+(1.2+(21.847536*POWER(B23,-0.22)))*C23/1000)*100/75","v":8.6658466397936671},6.35,null,null,null,null,350,900]
[null,400,900,7287,417,-37.5,{"$f":"0.6*stieren!$D$67","v":0},{"$f":"((0.0079*B24+0.66*stieren!$D$67-0.74)+(46.334688*POWER('voederbehoeftenormen '!B24,(-0.22))*C24/1000))*100/68","v":19.97177334650879},{"$f":"((0.83*stieren!$D$67)+(1.2+(21.847536*POWER(B24,-0.22)))*C24/1000)*100/75","v":8.4566612727740136},7.0642857142857149,null,null,null,null,400,1000]
[null,450,900,7879,446,-50,{"$f":"0.6*stieren!$D$67","v":0},{"$f":"((0.0079*B25+0.66*stieren!$D$67-0.74)+(46.334688*POWER('voederbehoeftenormen '!B25,(-0.22))*C25/1000))*100/68","v":20.132821862130516},{"$f":"((0.83*stieren!$D$67)+(1.2+(21.847536*POWER(B25,-0.22)))*C25/1000)*100/75","v":8.2771791041116263},7.7785714285714276,null,null,null,null,450,1100]
[null,500,900,8471,475,-62.5,{"$f":"0.6*stieren!$D$67","v":0},{"$f":"((0.0079*B26+0.66*stieren!$D$67-0.74)+(46.334688*POWER('voederbehoeftenormen '!B26,(-0.22))*C26/1000))*100/68","v":20.347258157712709},{"$f":"((0.83*stieren!$D$67)+(1.2+(21.847536*POWER(B26,-0.22)))*C26/1000)*100/75","v":8.12052061871535},8.4928571428571438,null,null,null,null,500,1200]
[null,550,900,9063,504,-75,{"$f":"0.6*stieren!$D$67","v":0},{"$f":"((0.0079*B27+0.66*stieren!$D$67-0.74)+(46.334688*POWER('voederbehoeftenormen '!B27,(-0.22))*C27/1000))*100/68","v":20.603888133177797},{"$f":"((0.83*stieren!$D$67)+(1.2+(21.847536*POWER(B27,-0.22)))*C27/1000)*100/75","v":7.9819002533943433},9.2071428571428573,null,null,null,null,550,1300]
[null,600,900,9655,533,-87.5,{"$f":"0.6*stieren!$D$67","v":0},{"$f":"((0.0079*B28+0.66*stieren!$D$67-0.74)+(46.334688*POWER('voederbehoeftenormen '!B28,(-0.22))*C28/1000))*100/68","v":20.894629782709465},{"$f":"((0.83*stieren!$D$67)+(1.2+(21.847536*POWER(B28,-0.22)))*C28/1000)*100/75","v":7.8578628889988069},9.9214285714285726,null,null,null,null,600,1400]
[null,650,900,10247,562,-100,{"$f":"0.6*stieren!$D$67","v":0},{"$f":"((0.0079*B29+0.66*stieren!$D$67-0.74)+(46.334688*POWER('voederbehoeftenormen '!B29,(-0.22))*C29/1000))*100/68","v":21.21346899464228},{"$f":"((0.83*stieren!$D$67)+(1.2+(21.847536*POWER(B29,-0.22)))*C29/1000)*100/75","v":7.7458374469058722},10.635714285714286,null,null,null,null,650,1500]
[null,700,900,10839,591,-112.5,{"$f":"0.6*stieren!$D$67","v":0},{"$f":"((0.0079*B30+0.66*stieren!$D$67-0.74)+(46.334688*POWER('voederbehoeftenormen '!B30,(-0.22))*C30/1000))*100/68","v":21.555816954525913},{"$f":"((0.83*stieren!$D$67)+(1.2+(21.847536*POWER(B30,-0.22)))*C30/1000)*100/75","v":7.6438621739267258},11.35,null,null,null,null,700,1600]
[null,350,1000,6847,432,-25,{"$f":"0.6*stieren!$D$67","v":0},{"$f":"((0.0079*B31+0.66*stieren!$D$67-0.74)+(46.334688*POWER('voederbehoeftenormen '!B31,(-0.22))*C31/1000))*100/68","v":21.758234043290535},{"$f":"((0.83*stieren!$D$67)+(1.2+(21.847536*POWER(B31,-0.22)))*C31/1000)*100/75","v":9.6287184886596293},6.5,null,null,null,null,null,1700]
[null,400,1000,7439,461,-37.5,{"$f":"0.6*stieren!$D$67","v":0},{"$f":"((0.0079*B32+0.66*stieren!$D$67-0.74)+(46.334688*POWER('voederbehoeftenormen '!B32,(-0.22))*C32/1000))*100/68","v":21.795434437297349},{"$f":"((0.83*stieren!$D$67)+(1.2+(21.847536*POWER(B32,-0.22)))*C32/1000)*100/75","v":9.3962903030822371},7.2142857142857144,null,null,null,null,null,1800]
[null,450,1000,8031,490,-50,{"$f":"0.6*stieren!$D$67","v":0},{"$f":"((0.0079*B33+0.66*stieren!$D$67-0.74)+(46.334688*POWER('voederbehoeftenormen '!B33,(-0.22))*C33/1000))*100/68","v":21.909834748772472},{"$f":"((0.83*stieren!$D$67)+(1.2+(21.847536*POWER(B33,-0.22)))*C33/1000)*100/75","v":9.1968656712351393},7.9285714285714297]
[null,500,1000,8623,519,-62.5,{"$f":"0.6*stieren!$D$67","v":0},{"$f":"((0.0079*B34+0.66*stieren!$D$67-0.74)+(46.334688*POWER('voederbehoeftenormen '!B34,(-0.22))*C34/1000))*100/68","v":22.083554815759218},{"$f":"((0.83*stieren!$D$67)+(1.2+(21.847536*POWER(B34,-0.22)))*C34/1000)*100/75","v":9.0228006874614994},8.6428571428571423]
[null,550,1000,9700,545,-75,{"$f":"0.6*stieren!$D$67","v":0},{"$f":"((0.0079*B35+0.66*stieren!$D$67-0.74)+(46.334688*POWER('voederbehoeftenormen '!B35,(-0.22))*C35/1000))*100/68","v":22.304156749282519},{"$f":"((0.83*stieren!$D$67)+(1.2+(21.847536*POWER(B35,-0.22)))*C35/1000)*100/75","v":8.8687780593270471},9.3571428571428577]
[null,600,1000,10100,575,-87.5,{"$f":"0.6*stieren!$D$67","v":0},{"$f":"((0.0079*B36+0.66*stieren!$D$67-0.74)+(46.334688*POWER('voederbehoeftenormen '!B36,(-0.22))*C36/1000))*100/68","v":22.562660542879797},{"$f":"((0.83*stieren!$D$67)+(1.2+(21.847536*POWER(B36,-0.22)))*C36/1000)*100/75","v":8.7309587655542291},10.071428571428571]
[null,650,1000,10410,595,-100,{"$f":"0.6*stieren!$D$67","v":0},{"$f":"((0.0079*B37+0.66*stieren!$D$67-0.74)+(46.334688*POWER('voederbehoeftenormen '!B37,(-0.22))*C37/1000))*100/68","v":22.852383850256128},{"$f":"((0.83*stieren!$D$67)+(1.2+(21.847536*POWER(B37,-0.22)))*C37/1000)*100/75","v":8.606486052117635},10.785714285714286]
[null,700,1000,10610,615,-112.5,{"$f":"0.6*stieren!$D$67","v":0},{"$f":"((0.0079*B38+0.66*stieren!$D$67-0.74)+(46.334688*POWER('voederbehoeftenormen '!B38,(-0.22))*C38/1000))*100/68","v":23.168227988688926},{"$f":"((0.83*stieren!$D$67)+(1.2+(21.847536*POWER(B38,-0.22)))*C38/1000)*100/75","v":8.4931801932519182},11.5]
[null,350,1100,6999,476,-25,{"$f":"0.6*stieren!$D$67","v":0},{"$f":"((0.0079*B39+0.66*stieren!$D$67-0.74)+(46.334688*POWER('voederbehoeftenormen '!B39,(-0.22))*C39/1000))*100/68","v":23.636263329972529},{"$f":"((0.83*stieren!$D$67)+(1.2+(21.847536*POWER(B39,-0.22)))*C39/1000)*100/75","v":10.591590337525593},6.65]
[null,400,1100,7591,505,-37.5,{"$f":"0.6*stieren!$D$67","v":0},{"$f":"((0.0079*B40+0.66*stieren!$D$67-0.74)+(46.334688*POWER('voederbehoeftenormen '!B40,(-0.22))*C40/1000))*100/68","v":23.619095528085907},{"$f":"((0.83*stieren!$D$67)+(1.2+(21.847536*POWER(B40,-0.22)))*C40/1000)*100/75","v":10.335919333390461},7.3642857142857148]
[null,450,1100,8183,534,-50,{"$f":"0.6*stieren!$D$67","v":0},{"$f":"((0.0079*B41+0.66*stieren!$D$67-0.74)+(46.334688*POWER('voederbehoeftenormen '!B41,(-0.22))*C41/1000))*100/68","v":23.686847635414424},{"$f":"((0.83*stieren!$D$67)+(1.2+(21.847536*POWER(B41,-0.22)))*C41/1000)*100/75","v":10.116552238358654},8.0785714285714274]
[null,500,1100,8775,563,-62.5,{"$f":"0.6*stieren!$D$67","v":0},{"$f":"((0.0079*B42+0.66*stieren!$D$67-0.74)+(46.334688*POWER('voederbehoeftenormen '!B42,(-0.22))*C42/1000))*100/68","v":23.819851473805723},{"$f":"((0.83*stieren!$D$67)+(1.2+(21.847536*POWER(B42,-0.22)))*C42/1000)*100/75","v":9.9250807562076506},8.7928571428571427]
[null,550,1100,9830,590,-75,{"$f":"0.6*stieren!$D$67","v":0},{"$f":"((0.0079*B43+0.66*stieren!$D$67-0.74)+(46.334688*POWER('voederbehoeftenormen '!B43,(-0.22))*C43/1000))*100/68","v":24.004425365387249},{"$f":"((0.83*stieren!$D$67)+(1.2+(21.847536*POWER(B43,-0.22)))*C43/1000)*100/75","v":9.7556558652597527},9.507142857142858]
[null,600,1100,10240,620,-87.5,{"$f":"0.6*stieren!$D$67","v":0},{"$f":"((0.0079*B44+0.66*stieren!$D$67-0.74)+(46.334688*POWER('voederbehoeftenormen '!B44,(-0.22))*C44/1000))*100/68","v":24.230691303050133},{"$f":"((0.83*stieren!$D$67)+(1.2+(21.847536*POWER(B44,-0.22)))*C44/1000)*100/75","v":9.6040546421096522},10.221428571428572]
[null,650,1100,10540,645,-100,{"$f":"0.6*stieren!$D$67","v":0},{"$f":"((0.0079*B45+0.66*stieren!$D$67-0.74)+(46.334688*POWER('voederbehoeftenormen '!B45,(-0.22))*C45/1000))*100/68","v":24.491298705869976},{"$f":"((0.83*stieren!$D$67)+(1.2+(21.847536*POWER(B45,-0.22)))*C45/1000)*100/75","v":9.4671346573293995},10.935714285714287]
[null,700,1100,10750,665,-112.5,{"$f":"0.6*stieren!$D$67","v":0},{"$f":"((0.0079*B46+0.66*stieren!$D$67-0.74)+(46.334688*POWER('voederbehoeftenormen '!B46,(-0.22))*C46/1000))*100/68","v":24.780639022851936},{"$f":"((0.83*stieren!$D$67)+(1.2+(21.847536*POWER(B46,-0.22)))*C46/1000)*100/75","v":9.3424982125771106},11.65]
[null,350,1200,7151,520,-25,{"$f":"0.6*stieren!$D$67","v":0},{"$f":"((0.0079*B47+0.66*stieren!$D$67-0.74)+(46.334688*POWER('voederbehoeftenormen '!B47,(-0.22))*C47/1000))*100/68","v":25.514292616654522},{"$f":"((0.83*stieren!$D$67)+(1.2+(21.847536*POWER(B47,-0.22)))*C47/1000)*100/75","v":11.554462186391556},6.8]
[null,400,1200,7743,549,-37.5,{"$f":"0.6*stieren!$D$67","v":0},{"$f":"((0.0079*B48+0.66*stieren!$D$67-0.74)+(46.334688*POWER('voederbehoeftenormen '!B48,(-0.22))*C48/1000))*100/68","v":25.442756618874469},{"$f":"((0.83*stieren!$D$67)+(1.2+(21.847536*POWER(B48,-0.22)))*C48/1000)*100/75","v":11.275548363698682},7.5142857142857142]
[null,450,1200,8335,578,-50,{"$f":"0.6*stieren!$D$67","v":0},{"$f":"((0.0079*B49+0.66*stieren!$D$67-0.74)+(46.334688*POWER('voederbehoeftenormen '!B49,(-0.22))*C49/1000))*100/68","v":25.463860522056372},{"$f":"((0.83*stieren!$D$67)+(1.2+(21.847536*POWER(B49,-0.22)))*C49/1000)*100/75","v":11.036238805482169},8.2285714285714295]
[null,500,1200,9450,610,-62.5,{"$f":"0.6*stieren!$D$67","v":0},{"$f":"((0.0079*B50+0.66*stieren!$D$67-0.74)+(46.334688*POWER('voederbehoeftenormen '!B50,(-0.22))*C50/1000))*100/68","v":25.55614813185224},{"$f":"((0.83*stieren!$D$67)+(1.2+(21.847536*POWER(B50,-0.22)))*C50/1000)*100/75","v":10.8273608249538},8.9428571428571431]
[null,550,1200,9960,635,-75,{"$f":"0.6*stieren!$D$67","v":0},{"$f":"((0.0079*B51+0.66*stieren!$D$67-0.74)+(46.334688*POWER('voederbehoeftenormen '!B51,(-0.22))*C51/1000))*100/68","v":25.704693981491967},{"$f":"((0.83*stieren!$D$67)+(1.2+(21.847536*POWER(B51,-0.22)))*C51/1000)*100/75","v":10.642533671192458},9.6571428571428584]
[null,600,1200,10370,665,-87.5,{"$f":"0.6*stieren!$D$67","v":0},{"$f":"((0.0079*B52+0.66*stieren!$D$67-0.74)+(46.334688*POWER('voederbehoeftenormen '!B52,(-0.22))*C52/1000))*100/68","v":25.898722063220461},{"$f":"((0.83*stieren!$D$67)+(1.2+(21.847536*POWER(B52,-0.22)))*C52/1000)*100/75","v":10.477150518665075},10.37142857142857]
[null,650,1200,10680,690,-100,{"$f":"0.6*stieren!$D$67","v":0},{"$f":"((0.0079*B53+0.66*stieren!$D$67-0.74)+(46.334688*POWER('voederbehoeftenormen '!B53,(-0.22))*C53/1000))*100/68","v":26.130213561483824},{"$f":"((0.83*stieren!$D$67)+(1.2+(21.847536*POWER(B53,-0.22)))*C53/1000)*100/75","v":10.327783262541164},11.085714285714287]
[null,700,1200,10890,715,-112.5,{"$f":"0.6*stieren!$D$67","v":0},{"$f":"((0.0079*B54+0.66*stieren!$D$67-0.74)+(46.334688*POWER('voederbehoeftenormen '!B54,(-0.22))*C54/1000))*100/68","v":26.39305005701495},{"$f":"((0.83*stieren!$D$67)+(1.2+(21.847536*POWER(B54,-0.22)))*C54/1000)*100/75","v":10.191816231902301},11.8]
[null,350,1300,7303,564,-25,{"$f":"0.6*stieren!$D$67","v":0},{"$f":"((0.0079*B55+0.66*stieren!$D$67-0.74)+(46.334688*POWER('voederbehoeftenormen '!B55,(-0.22))*C55/1000))*100/68","v":27.392321903336519},{"$f":"((0.83*stieren!$D$67)+(1.2+(21.847536*POWER(B55,-0.22)))*C55/1000)*100/75","v":12.517334035257518},6.95]
[null,400,1300,7895,593,-37.5,{"$f":"0.6*stieren!$D$67","v":0},{"$f":"((0.0079*B56+0.66*stieren!$D$67-0.74)+(46.334688*POWER('voederbehoeftenormen '!B56,(-0.22))*C56/1000))*100/68","v":27.266417709663024},{"$f":"((0.83*stieren!$D$67)+(1.2+(21.847536*POWER(B56,-0.22)))*C56/1000)*100/75","v":12.215177394006908},7.6642857142857137]
[null,450,1300,8960,630,-50,{"$f":"0.6*stieren!$D$67","v":0},{"$f":"((0.0079*B57+0.66*stieren!$D$67-0.74)+(46.334688*POWER('voederbehoeftenormen '!B57,(-0.22))*C57/1000))*100/68","v":27.240873408698331},{"$f":"((0.83*stieren!$D$67)+(1.2+(21.847536*POWER(B57,-0.22)))*C57/1000)*100/75","v":11.95592537260568},8.3785714285714299]
[null,500,1300,9570,655,-62.5,{"$f":"0.6*stieren!$D$67","v":0},{"$f":"((0.0079*B58+0.66*stieren!$D$67-0.74)+(46.334688*POWER('voederbehoeftenormen '!B58,(-0.22))*C58/1000))*100/68","v":27.292444789898749},{"$f":"((0.83*stieren!$D$67)+(1.2+(21.847536*POWER(B58,-0.22)))*C58/1000)*100/75","v":11.729640893699951},9.0928571428571434]
[null,550,1300,10080,680,-75,{"$f":"0.6*stieren!$D$67","v":0},{"$f":"((0.0079*B59+0.66*stieren!$D$67-0.74)+(46.334688*POWER('voederbehoeftenormen '!B59,(-0.22))*C59/1000))*100/68","v":27.404962597596686},{"$f":"((0.83*stieren!$D$67)+(1.2+(21.847536*POWER(B59,-0.22)))*C59/1000)*100/75","v":11.529411477125164},9.8071428571428587]
[null,600,1300,10500,715,-87.5,{"$f":"0.6*stieren!$D$67","v":0},{"$f":"((0.0079*B60+0.66*stieren!$D$67-0.74)+(46.334688*POWER('voederbehoeftenormen '!B60,(-0.22))*C60/1000))*100/68","v":27.566752823390797},{"$f":"((0.83*stieren!$D$67)+(1.2+(21.847536*POWER(B60,-0.22)))*C60/1000)*100/75","v":11.3502463952205},10.52142857142857]
[null,650,1300,10820,740,-100,{"$f":"0.6*stieren!$D$67","v":0},{"$f":"((0.0079*B61+0.66*stieren!$D$67-0.74)+(46.334688*POWER('voederbehoeftenormen '!B61,(-0.22))*C61/1000))*100/68","v":27.769128417097676},{"$f":"((0.83*stieren!$D$67)+(1.2+(21.847536*POWER(B61,-0.22)))*C61/1000)*100/75","v":11.188431867752927},11.235714285714284]
[null,700,1300,11030,765,-112.5,{"$f":"0.6*stieren!$D$67","v":0},{"$f":"((0.0079*B62+0.66*stieren!$D$67-0.74)+(46.334688*POWER('voederbehoeftenormen '!B62,(-0.22))*C62/1000))*100/68","v":28.00546109117796},{"$f":"((0.83*stieren!$D$67)+(1.2+(21.847536*POWER(B62,-0.22)))*C62/1000)*100/75","v":11.041134251227492},11.95]
[null,350,1400,7455,608,-25,{"$f":"0.6*stieren!$D$67","v":0},{"$f":"((0.0079*B63+0.66*stieren!$D$67-0.74)+(46.334688*POWER('voederbehoeftenormen '!B63,(-0.22))*C63/1000))*100/68","v":29.270351190018509},{"$f":"((0.83*stieren!$D$67)+(1.2+(21.847536*POWER(B63,-0.22)))*C63/1000)*100/75","v":13.48020588412348},7.1]
[null,400,1400,8370,640,-37.5,{"$f":"0.6*stieren!$D$67","v":0},{"$f":"((0.0079*B64+0.66*stieren!$D$67-0.74)+(46.334688*POWER('voederbehoeftenormen '!B64,(-0.22))*C64/1000))*100/68","v":29.090078800451579},{"$f":"((0.83*stieren!$D$67)+(1.2+(21.847536*POWER(B64,-0.22)))*C64/1000)*100/75","v":13.154806424315131},7.8142857142857149]
[null,450,1400,9080,675,-50,{"$f":"0.6*stieren!$D$67","v":0},{"$f":"((0.0079*B65+0.66*stieren!$D$67-0.74)+(46.334688*POWER('voederbehoeftenormen '!B65,(-0.22))*C65/1000))*100/68","v":29.017886295340283},{"$f":"((0.83*stieren!$D$67)+(1.2+(21.847536*POWER(B65,-0.22)))*C65/1000)*100/75","v":12.875611939729197},8.5285714285714285]
[null,500,1400,9690,695,-62.5,{"$f":"0.6*stieren!$D$67","v":0},{"$f":"((0.0079*B66+0.66*stieren!$D$67-0.74)+(46.334688*POWER('voederbehoeftenormen '!B66,(-0.22))*C66/1000))*100/68","v":29.028741447945254},{"$f":"((0.83*stieren!$D$67)+(1.2+(21.847536*POWER(B66,-0.22)))*C66/1000)*100/75","v":12.631920962446101},9.2428571428571438]
[null,550,1400,10210,720,-75,{"$f":"0.6*stieren!$D$67","v":0},{"$f":"((0.0079*B67+0.66*stieren!$D$67-0.74)+(46.334688*POWER('voederbehoeftenormen '!B67,(-0.22))*C67/1000))*100/68","v":29.105231213701412},{"$f":"((0.83*stieren!$D$67)+(1.2+(21.847536*POWER(B67,-0.22)))*C67/1000)*100/75","v":12.416289283057866},9.9571428571428573]
[null,600,1400,10630,760,-87.5,{"$f":"0.6*stieren!$D$67","v":0},{"$f":"((0.0079*B68+0.66*stieren!$D$67-0.74)+(46.334688*POWER('voederbehoeftenormen '!B68,(-0.22))*C68/1000))*100/68","v":29.234783583561132},{"$f":"((0.83*stieren!$D$67)+(1.2+(21.847536*POWER(B68,-0.22)))*C68/1000)*100/75","v":12.223342271775921},10.671428571428573]
[null,650,1400,10950,785,-100,{"$f":"0.6*stieren!$D$67","v":0},{"$f":"((0.0079*B69+0.66*stieren!$D$67-0.74)+(46.334688*POWER('voederbehoeftenormen '!B69,(-0.22))*C69/1000))*100/68","v":29.408043272711524},{"$f":"((0.83*stieren!$D$67)+(1.2+(21.847536*POWER(B69,-0.22)))*C69/1000)*100/75","v":12.049080472964693},11.385714285714286]
[null,700,1400,11180,810,-112.5,{"$f":"0.6*stieren!$D$67","v":0},{"$f":"((0.0079*B70+0.66*stieren!$D$67-0.74)+(46.334688*POWER('voederbehoeftenormen '!B70,(-0.22))*C70/1000))*100/68","v":29.61787212534097},{"$f":"((0.83*stieren!$D$67)+(1.2+(21.847536*POWER(B70,-0.22)))*C70/1000)*100/75","v":11.890452270552686},12.1]
[null,350,1500,7670,645,-25,{"$f":"0.6*stieren!$D$67","v":0},{"$f":"((0.0079*B71+0.66*stieren!$D$67-0.74)+(46.334688*POWER('voederbehoeftenormen '!B71,(-0.22))*C71/1000))*100/68","v":31.148380476700503},{"$f":"((0.83*stieren!$D$67)+(1.2+(21.847536*POWER(B71,-0.22)))*C71/1000)*100/75","v":14.443077732989444},7.25]
[null,400,1500,8480,680,-37.5,{"$f":"0.6*stieren!$D$67","v":0},{"$f":"((0.0079*B72+0.66*stieren!$D$67-0.74)+(46.334688*POWER('voederbehoeftenormen '!B72,(-0.22))*C72/1000))*100/68","v":30.913739891240144},{"$f":"((0.83*stieren!$D$67)+(1.2+(21.847536*POWER(B72,-0.22)))*C72/1000)*100/75","v":14.094435454623353},7.9642857142857144]
[null,450,1500,9200,715,-50,{"$f":"0.6*stieren!$D$67","v":0},{"$f":"((0.0079*B73+0.66*stieren!$D$67-0.74)+(46.334688*POWER('voederbehoeftenormen '!B73,(-0.22))*C73/1000))*100/68","v":30.794899181982231},{"$f":"((0.83*stieren!$D$67)+(1.2+(21.847536*POWER(B73,-0.22)))*C73/1000)*100/75","v":13.795298506852712},8.6785714285714288]
[null,500,1500,9820,740,-62.5,{"$f":"0.6*stieren!$D$67","v":0},{"$f":"((0.0079*B74+0.66*stieren!$D$67-0.74)+(46.334688*POWER('voederbehoeftenormen '!B74,(-0.22))*C74/1000))*100/68","v":30.765038105991767},{"$f":"((0.83*stieren!$D$67)+(1.2+(21.847536*POWER(B74,-0.22)))*C74/1000)*100/75","v":13.534201031192248},9.3928571428571423]
[null,550,1500,10340,765,-75,{"$f":"0.6*stieren!$D$67","v":0},{"$f":"((0.0079*B75+0.66*stieren!$D$67-0.74)+(46.334688*POWER('voederbehoeftenormen '!B75,(-0.22))*C75/1000))*100/68","v":30.805499829806141},{"$f":"((0.83*stieren!$D$67)+(1.2+(21.847536*POWER(B75,-0.22)))*C75/1000)*100/75","v":13.303167088990572},10.107142857142858]
[null,600,1500,10760,805,-87.5,{"$f":"0.6*stieren!$D$67","v":0},{"$f":"((0.0079*B76+0.66*stieren!$D$67-0.74)+(46.334688*POWER('voederbehoeftenormen '!B76,(-0.22))*C76/1000))*100/68","v":30.902814343731468},{"$f":"((0.83*stieren!$D$67)+(1.2+(21.847536*POWER(B76,-0.22)))*C76/1000)*100/75","v":13.096438148331341},10.821428571428571]
[null,650,1500,"-","-","-","-","-","-","-"]
[null,700,1500,"-","-","-","-","-","-","-"]
[null,350,1600,7780,680,-25,{"$f":"0.6*stieren!$D$67","v":0},{"$f":"((0.0079*B79+0.66*stieren!$D$67-0.74)+(46.334688*POWER('voederbehoeftenormen '!B79,(-0.22))*C79/1000))*100/68","v":33.02640976338251},{"$f":"((0.83*stieren!$D$67)+(1.2+(21.847536*POWER(B79,-0.22)))*C79/1000)*100/75","v":15.405949581855406},7.4]
[null,400,1600,8600,715,-37.5,{"$f":"0.6*stieren!$D$67","v":0},{"$f":"((0.0079*B80+0.66*stieren!$D$67-0.74)+(46.334688*POWER('voederbehoeftenormen '!B80,(-0.22))*C80/1000))*100/68","v":32.737400982028703},{"$f":"((0.83*stieren!$D$67)+(1.2+(21.847536*POWER(B80,-0.22)))*C80/1000)*100/75","v":15.034064484931578},8.1142857142857157]
[null,450,1600,9320,755,-50,{"$f":"0.6*stieren!$D$67","v":0},{"$f":"((0.0079*B81+0.66*stieren!$D$67-0.74)+(46.334688*POWER('voederbehoeftenormen '!B81,(-0.22))*C81/1000))*100/68","v":32.571912068624187},{"$f":"((0.83*stieren!$D$67)+(1.2+(21.847536*POWER(B81,-0.22)))*C81/1000)*100/75","v":14.714985073976223},8.8285714285714274]
[null,500,1600,9940,780,-62.5,{"$f":"0.6*stieren!$D$67","v":0},{"$f":"((0.0079*B82+0.66*stieren!$D$67-0.74)+(46.334688*POWER('voederbehoeftenormen '!B82,(-0.22))*C82/1000))*100/68","v":32.501334764038283},{"$f":"((0.83*stieren!$D$67)+(1.2+(21.847536*POWER(B82,-0.22)))*C82/1000)*100/75","v":14.436481099938401},9.5428571428571427]
[null,550,1600,10470,810,-75,{"$f":"0.6*stieren!$D$67","v":0},{"$f":"((0.0079*B83+0.66*stieren!$D$67-0.74)+(46.334688*POWER('voederbehoeftenormen '!B83,(-0.22))*C83/1000))*100/68","v":32.50576844591086},{"$f":"((0.83*stieren!$D$67)+(1.2+(21.847536*POWER(B83,-0.22)))*C83/1000)*100/75","v":14.190044894923275},10.257142857142858]
[null,600,1600,"-","-","-","-","-","-","-"]
[null,650,1600,"-","-","-","-","-","-","-"]
[null,700,1600,"-","-","-","-","-","-","-"]
[null,350,1700,7890,720,-25,{"$f":"0.6*stieren!$D$67","v":0},{"$f":"((0.0079*B87+0.66*stieren!$D$67-0.74)+(46.334688*POWER('voederbehoeftenormen '!B87,(-0.22))*C87/1000))*100/68","v":34.904439050064504},{"$f":"((0.83*stieren!$D$67)+(1.2+(21.847536*POWER(B87,-0.22)))*C87/1000)*100/75","v":16.368821430721368},7.55]
[null,400,1700,8710,755,-37.5,{"$f":"0.6*stieren!$D$67","v":0},{"$f":"((0.0079*B88+0.66*stieren!$D$67-0.74)+(46.334688*POWER('voederbehoeftenormen '!B88,(-0.22))*C88/1000))*100/68","v":34.561062072817258},{"$f":"((0.83*stieren!$D$67)+(1.2+(21.847536*POWER(B88,-0.22)))*C88/1000)*100/75","v":15.973693515239802},8.2642857142857142]
[null,450,1700,9440,795,-50,{"$f":"0.6*stieren!$D$67","v":0},{"$f":"((0.0079*B89+0.66*stieren!$D$67-0.74)+(46.334688*POWER('voederbehoeftenormen '!B89,(-0.22))*C89/1000))*100/68","v":34.348924955266135},{"$f":"((0.83*stieren!$D$67)+(1.2+(21.847536*POWER(B89,-0.22)))*C89/1000)*100/75","v":15.63467164109974},8.9785714285714295]
[null,500,1700,10060,825,-62.5,{"$f":"0.6*stieren!$D$67","v":0},{"$f":"((0.0079*B90+0.66*stieren!$D$67-0.74)+(46.334688*POWER('voederbehoeftenormen '!B90,(-0.22))*C90/1000))*100/68","v":34.237631422084789},{"$f":"((0.83*stieren!$D$67)+(1.2+(21.847536*POWER(B90,-0.22)))*C90/1000)*100/75","v":15.338761168684551},9.6928571428571413]
[null,550,1700,10590,850,-75,{"$f":"0.6*stieren!$D$67","v":0},{"$f":"((0.0079*B91+0.66*stieren!$D$67-0.74)+(46.334688*POWER('voederbehoeftenormen '!B91,(-0.22))*C91/1000))*100/68","v":34.206037062015582},{"$f":"((0.83*stieren!$D$67)+(1.2+(21.847536*POWER(B91,-0.22)))*C91/1000)*100/75","v":15.076922700855981},10.407142857142858]
[null,600,1700,"-","-","-","-","-","-","-"]
[null,650,1700,"-","-","-","-","-","-","-"]
[null,700,1700,"-","-","-","-","-","-","-"]
[null,350,1800,"-","-","-","-","-","-","-"]
[null,400,1800,8820,795,-37.5,{"$f":"0.6*stieren!$D$67","v":0},{"$f":"((0.0079*B96+0.66*stieren!$D$67-0.74)+(46.334688*POWER('voederbehoeftenormen '!B96,(-0.22))*C96/1000))*100/68","v":36.384723163605813},{"$f":"((0.83*stieren!$D$67)+(1.2+(21.847536*POWER(B96,-0.22)))*C96/1000)*100/75","v":16.913322545548027},8.4142857142857146]
[null,450,1800,9550,835,-50,{"$f":"0.6*stieren!$D$67","v":0},{"$f":"((0.0079*B97+0.66*stieren!$D$67-0.74)+(46.334688*POWER('voederbehoeftenormen '!B97,(-0.22))*C97/1000))*100/68","v":36.12593784190809},{"$f":"((0.83*stieren!$D$67)+(1.2+(21.847536*POWER(B97,-0.22)))*C97/1000)*100/75","v":16.554358208223253},9.1285714285714281]
[null,500,1800,10190,865,-62.5,{"$f":"0.6*stieren!$D$67","v":0},{"$f":"((0.0079*B98+0.66*stieren!$D$67-0.74)+(46.334688*POWER('voederbehoeftenormen '!B98,(-0.22))*C98/1000))*100/68","v":35.973928080131301},{"$f":"((0.83*stieren!$D$67)+(1.2+(21.847536*POWER(B98,-0.22)))*C98/1000)*100/75","v":16.2410412374307},9.8428571428571434]
[null,550,1800,"-","-","-","-","-","-","-"]
[null,600,1800,"-","-","-","-","-","-","-"]
[null,650,1800,"-","-","-","-","-","-","-"]
[null,700,1800,"-","-","-","-","-","-","-"]
[]
[]
[]
["vrouwelijk jongvee"]
[]
[null,"Leeftijd (maanden)","Gemiddeld gewicht (kg)","Groei (g/dag)","DS-opname ","VEM","DVE (g)","OEB (g)","Structuur (/kg DS)","Ca (g/kg DS)","P (g/kg DS)","Mg (g)","Na (g/kg DS)",null,null,"Leeftijd (maanden)"]
[null,"  3 -   6",155,800,"4 – 5",3000,275,0,{"$f":"0.6*'vrouwelijk jongvee'!$D$67","v":0},{"$f":"(((0.0079*C109)+(0.66*'vrouwelijk jongvee'!$D$67)-0.74)+((9.83*4.2522*POWER('voederbehoeftenormen '!C109,-0.22))*'voederbehoeftenormen '!D109/1000))*100/68","v":16.925944962630176},{"$f":"((0.83*'vrouwelijk jongvee'!$D$67)+(1.2+4.635*4.2522*POWER('voederbehoeftenormen '!C109,-0.22))*'voederbehoeftenormen '!D109/1000)*100/75","v":8.2113714253262504},{"$f":"(0.004*C109+0.42*(D109/1000))*100/28","v":3.4142857142857141},null,null,null,"  3 -   6"]
[null,"  6 -   9",220,750,"4,5 – 5,5",3865,320,0,{"$f":"0.6*'vrouwelijk jongvee'!$D$67","v":0},{"$f":"(((0.0079*C110)+(0.66*'vrouwelijk jongvee'!$D$67)-0.74)+((9.83*4.2522*POWER('voederbehoeftenormen '!C110,-0.22))*'voederbehoeftenormen '!D110/1000))*100/68","v":15.540642982853489},{"$f":"((0.83*'vrouwelijk jongvee'!$D$67)+(1.2+4.635*4.2522*POWER('voederbehoeftenormen '!C110,-0.22))*'voederbehoeftenormen '!D110/1000)*100/75","v":7.216313130329957},{"$f":"(0.004*C110+0.42*(D110/1000))*100/28","v":4.2678571428571432},null,null,null,"  6 -   9"]
[null,"  9 – 12",290,750,"5 – 6",4925,375,-10,{"$f":"0.6*'vrouwelijk jongvee'!$D$67","v":0},{"$f":"(((0.0079*C111)+(0.66*'vrouwelijk jongvee'!$D$67)-0.74)+((9.83*4.2522*POWER('voederbehoeftenormen '!C111,-0.22))*'voederbehoeftenormen '!D111/1000))*100/68","v":15.524053514271673},{"$f":"((0.83*'vrouwelijk jongvee'!$D$67)+(1.2+4.635*4.2522*POWER('voederbehoeftenormen '!C111,-0.22))*'voederbehoeftenormen '!D111/1000)*100/75","v":6.8615567129578103},5.2678571428571432,null,null,null,"  9 – 12"]
[null,"12 – 15",360,750,"6 – 7",5950,425,-27.5,{"$f":"0.6*'vrouwelijk jongvee'!$D$67","v":0},{"$f":"(((0.0079*C112)+(0.66*'vrouwelijk jongvee'!$D$67)-0.74)+((9.83*4.2522*POWER('voederbehoeftenormen '!C112,-0.22))*'voederbehoeftenormen '!D112/1000))*100/68","v":15.722071945988095},{"$f":"((0.83*'vrouwelijk jongvee'!$D$67)+(1.2+4.635*4.2522*POWER('voederbehoeftenormen '!C112,-0.22))*'voederbehoeftenormen '!D112/1000)*100/75","v":6.5985468103581253},6.2678571428571432,null,null,null,"12 – 15"]
[null,"15 – 18",425,750,"7 – 8",6880,465,-43.75,{"$f":"0.6*'vrouwelijk jongvee'!$D$67","v":0},{"$f":"(((0.0079*C113)+(0.66*'vrouwelijk jongvee'!$D$67)-0.74)+((9.83*4.2522*POWER('voederbehoeftenormen '!C113,-0.22))*'voederbehoeftenormen '!D113/1000))*100/68","v":16.024405357766014},{"$f":"((0.83*'vrouwelijk jongvee'!$D$67)+(1.2+4.635*4.2522*POWER('voederbehoeftenormen '!C113,-0.22))*'voederbehoeftenormen '!D113/1000)*100/75","v":6.4049655214115857},7.1964285714285712,null,null,null,"15 – 18"]
[null,"18 – 21",495,750,"8 – 9",7865,510,-61.25,{"$f":"0.6*'vrouwelijk jongvee'!$D$67","v":0},{"$f":"(((0.0079*C114)+(0.66*'vrouwelijk jongvee'!$D$67)-0.74)+((9.83*4.2522*POWER('voederbehoeftenormen '!C114,-0.22))*'voederbehoeftenormen '!D114/1000))*100/68","v":16.436022223249303},{"$f":"((0.83*'vrouwelijk jongvee'!$D$67)+(1.2+4.635*4.2522*POWER('voederbehoeftenormen '!C114,-0.22))*'voederbehoeftenormen '!D114/1000)*100/75","v":6.2332705789402709},8.1964285714285712,null,null,null,"18 – 21"]
[null,"21 – 24",570,850,"9 – 10",8900,685,-80,{"$f":"0.6*'vrouwelijk jongvee'!$D$67","v":0},{"$f":"(((0.0079*C115)+(0.66*'vrouwelijk jongvee'!$D$67)-0.74)+((9.83*4.2522*POWER('voederbehoeftenormen '!C115,-0.22))*'voederbehoeftenormen '!D115/1000))*100/68","v":18.46936896478444},{"$f":"((0.83*'vrouwelijk jongvee'!$D$67)+(1.2+4.635*4.2522*POWER('voederbehoeftenormen '!C115,-0.22))*'voederbehoeftenormen '!D115/1000)*100/75","v":6.8900443680173069},9.4178571428571445,null,null,null,"21 – 24"]
[null,24,6101,"-","-","-","-"]

{"sheet":"startpagina","index":1,"n_rows":0,"n_cols":0,"rows_kept":0,"cut":false,"hidden":false,"merged":[]}

{"sheet":"vrouwelijk jongvee","index":2,"n_rows":105,"n_cols":12,"rows_kept":105,"cut":false,"hidden":false,"merged":[[79,3,79,4],[80,3,80,4],[81,3,81,4],[82,3,82,4],[65,1,65,2],[66,1,66,2],[76,3,76,4],[77,3,77,4]]}
[]
[null,"vrouwelijk jongvee"]
[]
[null,null,null,null,null,null,null,null,null,null,"energieprijs en eiwittoeslagprijs (in eurocenten)"]
[null,"voedermiddelen",null,null,null,null,null,null,null,null,"per kVEM",0]
[null,null,null,null,null,null,null,null,null,null,"per kg DVE-toeslag",0]
[null,null,null,null,null,null,null,null,null,null,"datum"]
[null,null,"soort voedermiddel","DS                (g DS/kg VS)","VEM                  (/kg DS)","VEVI                         (/kg DS)","DVE                             (g/kg DS)","OEB                         (g/kg DS)","RE                          (g/kg DS)",null,"kostprijs voeder-middel (€/ton VS)","voederwaardeprijs (€/ton VS)"]
[null,"voedermiddel1","(voedermiddel)",{"$f":"VLOOKUP('vrouwelijk jongvee'!$C9,'lijst voedermiddelen'!$B$2:$N$198,2,FALSE)","v":0},{"$f":"VLOOKUP('vrouwelijk jongvee'!$C9,'lijst voedermiddelen'!$B$2:$N$198,3,FALSE)","v":0},{"$f":"VLOOKUP('vrouwelijk jongvee'!$C9,'lijst voedermiddelen'!$B$2:$N$198,4,FALSE)","v":0},{"$f":"VLOOKUP('vrouwelijk jongvee'!$C9,'lijst voedermiddelen'!$B$2:$N$198,5,FALSE)","v":0},{"$f":"VLOOKUP('vrouwelijk jongvee'!$C9,'lijst voedermiddelen'!$B$2:$N$198,6,FALSE)","v":0},{"$f":"VLOOKUP('vrouwelijk jongvee'!$C9,'lijst voedermiddelen'!$B$2:$N$198,7,FALSE)","v":0},null,0,{"$f":"IFERROR((VLOOKUP('vrouwelijk jongvee'!C9,'lijst voedermiddelen'!$B$2:$P$198,2,FALSE)/1000)*(((L$5*VLOOKUP('vrouwelijk jongvee'!C9,'lijst voedermiddelen'!$B$2:$P$198,3,FALSE))+(L$6*VLOOKUP('vrouwelijk jongvee'!$C9,'lijst voedermiddelen'!$B$2:$P$198,5,FALSE)))/1000)*(1-VLOOKUP('vrouwelijk jongvee'!$C9,'lijst voedermiddelen'!$B$2:$P$198,15,FALSE)/100)*10,\"-\")","v":0}]
[null,"voedermiddel2","(voedermiddel)",{"$f":"VLOOKUP('vrouwelijk jongvee'!$C10,'lijst voedermiddelen'!$B$2:$N$198,2,FALSE)","v":0},{"$f":"VLOOKUP('vrouwelijk jongvee'!$C10,'lijst voedermiddelen'!$B$2:$N$198,3,FALSE)","v":0},{"$f":"VLOOKUP('vrouwelijk jongvee'!$C10,'lijst voedermiddelen'!$B$2:$N$198,4,FALSE)","v":0},{"$f":"VLOOKUP('vrouwelijk jongvee'!$C10,'lijst voedermiddelen'!$B$2:$N$198,5,FALSE)","v":0},{"$f":"VLOOKUP('vrouwelijk jongvee'!$C10,'lijst voedermiddelen'!$B$2:$N$198,6,FALSE)","v":0},{"$f":"VLOOKUP('vrouwelijk jongvee'!$C10,'lijst voedermiddelen'!$B$2:$N$198,7,FALSE)","v":0},null,0,{"$f":"IFERROR((VLOOKUP('vrouwelijk jongvee'!C10,'lijst voedermiddelen'!$B$2:$P$198,2,FALSE)/1000)*(((L$5*VLOOKUP('vrouwelijk jongvee'!C10,'lijst voedermiddelen'!$B$2:$P$198,3,FALSE))+(L$6*VLOOKUP('vrouwelijk jongvee'!$C10,'lijst voedermiddelen'!$B$2:$P$198,5,FALSE)))/1000)*(1-VLOOKUP('vrouwelijk jongvee'!$C10,'lijst voedermiddelen'!$B$2:$P$198,15,FALSE)/100)*10,\"-\")","v":0}]
[null,"voedermiddel3","(voedermiddel)",{"$f":"VLOOKUP('vrouwelijk jongvee'!$C11,'lijst voedermiddelen'!$B$2:$N$198,2,FALSE)","v":0},{"$f":"VLOOKUP('vrouwelijk jongvee'!$C11,'lijst voedermiddelen'!$B$2:$N$198,3,FALSE)","v":0},{"$f":"VLOOKUP('vrouwelijk jongvee'!$C11,'lijst voedermiddelen'!$B$2:$N$198,4,FALSE)","v":0},{"$f":"VLOOKUP('vrouwelijk jongvee'!$C11,'lijst voedermiddelen'!$B$2:$N$198,5,FALSE)","v":0},{"$f":"VLOOKUP('vrouwelijk jongvee'!$C11,'lijst voedermiddelen'!$B$2:$N$198,6,FALSE)","v":0},{"$f":"VLOOKUP('vrouwelijk jongvee'!$C11,'lijst voedermiddelen'!$B$2:$N$198,7,FALSE)","v":0},null,0,{"$f":"IFERROR((VLOOKUP('vrouwelijk jongvee'!C11,'lijst voedermiddelen'!$B$2:$P$198,2,FALSE)/1000)*(((L$5*VLOOKUP('vrouwelijk jongvee'!C11,'lijst voedermiddelen'!$B$2:$P$198,3,FALSE))+(L$6*VLOOKUP('vrouwelijk jongvee'!$C11,'lijst voedermiddelen'!$B$2:$P$198,5,FALSE)))/1000)*(1-VLOOKUP('vrouwelijk jongvee'!$C11,'lijst voedermiddelen'!$B$2:$P$198,15,FALSE)/100)*10,\"-\")","v":0}]
[null,"voedermiddel4","(voedermiddel)",{"$f":"VLOOKUP('vrouwelijk jongvee'!$C12,'lijst voedermiddelen'!$B$2:$N$198,2,FALSE)","v":0},{"$f":"VLOOKUP('vrouwelijk jongvee'!$C12,'lijst voedermiddelen'!$B$2:$N$198,3,FALSE)","v":0},{"$f":"VLOOKUP('vrouwelijk jongvee'!$C12,'lijst voedermiddelen'!$B$2:$N$198,4,FALSE)","v":0},{"$f":"VLOOKUP('vrouwelijk jongvee'!$C12,'lijst voedermiddelen'!$B$2:$N$198,5,FALSE)","v":0},{"$f":"VLOOKUP('vrouwelijk jongvee'!$C12,'lijst voedermiddelen'!$B$2:$N$198,6,FALSE)","v":0},{"$f":"VLOOKUP('vrouwelijk jongvee'!$C12,'lijst voedermiddelen'!$B$2:$N$198,7,FALSE)","v":0},null,0,{"$f":"IFERROR((VLOOKUP('vrouwelijk jongvee'!C12,'lijst voedermiddelen'!$B$2:$P$198,2,FALSE)/1000)*(((L$5*VLOOKUP('vrouwelijk jongvee'!C12,'lijst voedermiddelen'!$B$2:$P$198,3,FALSE))+(L$6*VLOOKUP('vrouwelijk jongvee'!$C12,'lijst voedermiddelen'!$B$2:$P$198,5,FALSE)))/1000)*(1-VLOOKUP('vrouwelijk jongvee'!$C12,'lijst voedermiddelen'!$B$2:$P$198,15,FALSE)/100)*10,\"-\")","v":0}]
[null,"voedermiddel5","(voedermiddel)",{"$f":"VLOOKUP('vrouwelijk jongvee'!$C13,'lijst voedermiddelen'!$B$2:$N$198,2,FALSE)","v":0},{"$f":"VLOOKUP('vrouwelijk jongvee'!$C13,'lijst voedermiddelen'!$B$2:$N$198,3,FALSE)","v":0},{"$f":"VLOOKUP('vrouwelijk jongvee'!$C13,'lijst voedermiddelen'!$B$2:$N$198,4,FALSE)","v":0},{"$f":"VLOOKUP('vrouwelijk jongvee'!$C13,'lijst voedermiddelen'!$B$2:$N$198,5,FALSE)","v":0},{"$f":"VLOOKUP('vrouwelijk jongvee'!$C13,'lijst voedermiddelen'!$B$2:$N$198,6,FALSE)","v":0},{"$f":"VLOOKUP('vrouwelijk jongvee'!$C13,'lijst voedermiddelen'!$B$2:$N$198,7,FALSE)","v":0},null,0,{"$f":"IFERROR((VLOOKUP('vrouwelijk jongvee'!C13,'lijst voedermiddelen'!$B$2:$P$198,2,FALSE)/1000)*(((L$5*VLOOKUP('vrouwelijk jongvee'!C13,'lijst voedermiddelen'!$B$2:$P$198,3,FALSE))+(L$6*VLOOKUP('vrouwelijk jongvee'!$C13,'lijst voedermiddelen'!$B$2:$P$198,5,FALSE)))/1000)*(1-VLOOKUP('vrouwelijk jongvee'!$C13,'lijst voedermiddelen'!$B$2:$P$198,15,FALSE)/100)*10,\"-\")","v":0}]
[null,"voedermiddel6","(voedermiddel)",{"$f":"VLOOKUP('vrouwelijk jongvee'!$C14,'lijst voedermiddelen'!$B$2:$N$198,2,FALSE)","v":0},{"$f":"VLOOKUP('vrouwelijk jongvee'!$C14,'lijst voedermiddelen'!$B$2:$N$198,3,FALSE)","v":0},{"$f":"VLOOKUP('vrouwelijk jongvee'!$C14,'lijst voedermiddelen'!$B$2:$N$198,4,FALSE)","v":0},{"$f":"VLOOKUP('vrouwelijk jongvee'!$C14,'lijst voedermiddelen'!$B$2:$N$198,5,FALSE)","v":0},{"$f":"VLOOKUP('vrouwelijk jongvee'!$C14,'lijst voedermiddelen'!$B$2:$N$198,6,FALSE)","v":0},{"$f":"VLOOKUP('vrouwelijk jongvee'!$C14,'lijst voedermiddelen'!$B$2:$N$198,7,FALSE)","v":0},null,0,{"$f":"IFERROR((VLOOKUP('vrouwelijk jongvee'!C14,'lijst voedermiddelen'!$B$2:$P$198,2,FALSE)/1000)*(((L$5*VLOOKUP('vrouwelijk jongvee'!C14,'lijst voedermiddelen'!$B$2:$P$198,3,FALSE))+(L$6*VLOOKUP('vrouwelijk jongvee'!$C14,'lijst voedermiddelen'!$B$2:$P$198,5,FALSE)))/1000)*(1-VLOOKUP('vrouwelijk jongvee'!$C14,'lijst voedermiddelen'!$B$2:$P$198,15,FALSE)/100)*10,\"-\")","v":0}]
[null,"voedermiddel7","(voedermiddel)",{"$f":"VLOOKUP('vrouwelijk jongvee'!$C15,'lijst voedermiddelen'!$B$2:$N$198,2,FALSE)","v":0},{"$f":"VLOOKUP('vrouwelijk jongvee'!$C15,'lijst voedermiddelen'!$B$2:$N$198,3,FALSE)","v":0},{"$f":"VLOOKUP('vrouwelijk jongvee'!$C15,'lijst voedermiddelen'!$B$2:$N$198,4,FALSE)","v":0},{"$f":"VLOOKUP('vrouwelijk jongvee'!$C15,'lijst voedermiddelen'!$B$2:$N$198,5,FALSE)","v":0},{"$f":"VLOOKUP('vrouwelijk jongvee'!$C15,'lijst voedermiddelen'!$B$2:$N$198,6,FALSE)","v":0},{"$f":"VLOOKUP('vrouwelijk jongvee'!$C15,'lijst voedermiddelen'!$B$2:$N$198,7,FALSE)","v":0},null,0,{"$f":"IFERROR((VLOOKUP('vrouwelijk jongvee'!C15,'lijst voedermiddelen'!$B$2:$P$198,2,FALSE)/1000)*(((L$5*VLOOKUP('vrouwelijk jongvee'!C15,'lijst voedermiddelen'!$B$2:$P$198,3,FALSE))+(L$6*VLOOKUP('vrouwelijk jongvee'!$C15,'lijst voedermiddelen'!$B$2:$P$198,5,FALSE)))/1000)*(1-VLOOKUP('vrouwelijk jongvee'!$C15,'lijst voedermiddelen'!$B$2:$P$198,15,FALSE)/100)*10,\"-\")","v":0}]
[null,"voedermiddel8","(voedermiddel)",{"$f":"VLOOKUP('vrouwelijk jongvee'!$C16,'lijst voedermiddelen'!$B$2:$N$198,2,FALSE)","v":0},{"$f":"VLOOKUP('vrouwelijk jongvee'!$C16,'lijst voedermiddelen'!$B$2:$N$198,3,FALSE)","v":0},{"$f":"VLOOKUP('vrouwelijk jongvee'!$C16,'lijst voedermiddelen'!$B$2:$N$198,4,FALSE)","v":0},{"$f":"VLOOKUP('vrouwelijk jongvee'!$C16,'lijst voedermiddelen'!$B$2:$N$198,5,FALSE)","v":0},{"$f":"VLOOKUP('vrouwelijk jongvee'!$C16,'lijst voedermiddelen'!$B$2:$N$198,6,FALSE)","v":0},{"$f":"VLOOKUP('vrouwelijk jongvee'!$C16,'lijst voedermiddelen'!$B$2:$N$198,7,FALSE)","v":0},null,0,{"$f":"IFERROR((VLOOKUP('vrouwelijk jongvee'!C16,'lijst voedermiddelen'!$B$2:$P$198,2,FALSE)/1000)*(((L$5*VLOOKUP('vrouwelijk jongvee'!C16,'lijst voedermiddelen'!$B$2:$P$198,3,FALSE))+(L$6*VLOOKUP('vrouwelijk jongvee'!$C16,'lijst voedermiddelen'!$B$2:$P$198,5,FALSE)))/1000)*(1-VLOOKUP('vrouwelijk jongvee'!$C16,'lijst voedermiddelen'!$B$2:$P$198,15,FALSE)/100)*10,\"-\")","v":0}]
[null,"voedermiddel9","(voedermiddel)",{"$f":"VLOOKUP('vrouwelijk jongvee'!$C17,'lijst voedermiddelen'!$B$2:$N$198,2,FALSE)","v":0},{"$f":"VLOOKUP('vrouwelijk jongvee'!$C17,'lijst voedermiddelen'!$B$2:$N$198,3,FALSE)","v":0},{"$f":"VLOOKUP('vrouwelijk jongvee'!$C17,'lijst voedermiddelen'!$B$2:$N$198,4,FALSE)","v":0},{"$f":"VLOOKUP('vrouwelijk jongvee'!$C17,'lijst voedermiddelen'!$B$2:$N$198,5,FALSE)","v":0},{"$f":"VLOOKUP('vrouwelijk jongvee'!$C17,'lijst voedermiddelen'!$B$2:$N$198,6,FALSE)","v":0},{"$f":"VLOOKUP('vrouwelijk jongvee'!$C17,'lijst voedermiddelen'!$B$2:$N$198,7,FALSE)","v":0},null,0,{"$f":"IFERROR((VLOOKUP('vrouwelijk jongvee'!C17,'lijst voedermiddelen'!$B$2:$P$198,2,FALSE)/1000)*(((L$5*VLOOKUP('vrouwelijk jongvee'!C17,'lijst voedermiddelen'!$B$2:$P$198,3,FALSE))+(L$6*VLOOKUP('vrouwelijk jongvee'!$C17,'lijst voedermiddelen'!$B$2:$P$198,5,FALSE)))/1000)*(1-VLOOKUP('vrouwelijk jongvee'!$C17,'lijst voedermiddelen'!$B$2:$P$198,15,FALSE)/100)*10,\"-\")","v":0}]
[null,"voedermiddel10","(voedermiddel)",{"$f":"VLOOKUP('vrouwelijk jongvee'!$C18,'lijst voedermiddelen'!$B$2:$N$198,2,FALSE)","v":0},{"$f":"VLOOKUP('vrouwelijk jongvee'!$C18,'lijst voedermiddelen'!$B$2:$N$198,3,FALSE)","v":0},{"$f":"VLOOKUP('vrouwelijk jongvee'!$C18,'lijst voedermiddelen'!$B$2:$N$198,4,FALSE)","v":0},{"$f":"VLOOKUP('vrouwelijk jongvee'!$C18,'lijst voedermiddelen'!$B$2:$N$198,5,FALSE)","v":0},{"$f":"VLOOKUP('vrouwelijk jongvee'!$C18,'lijst voedermiddelen'!$B$2:$N$198,6,FALSE)","v":0},{"$f":"VLOOKUP('vrouwelijk jongvee'!$C18,'lijst voedermiddelen'!$B$2:$N$198,7,FALSE)","v":0},null,0,{"$f":"IFERROR((VLOOKUP('vrouwelijk jongvee'!C18,'lijst voedermiddelen'!$B$2:$P$198,2,FALSE)/1000)*(((L$5*VLOOKUP('vrouwelijk jongvee'!C18,'lijst voedermiddelen'!$B$2:$P$198,3,FALSE))+(L$6*VLOOKUP('vrouwelijk jongvee'!$C18,'lijst voedermiddelen'!$B$2:$P$198,5,FALSE)))/1000)*(1-VLOOKUP('vrouwelijk jongvee'!$C18,'lijst voedermiddelen'!$B$2:$P$198,15,FALSE)/100)*10,\"-\")","v":0}]
[null,"voedermiddel11","(voedermiddel)",{"$f":"VLOOKUP('vrouwelijk jongvee'!$C19,'lijst voedermiddelen'!$B$2:$N$198,2,FALSE)","v":0},{"$f":"VLOOKUP('vrouwelijk jongvee'!$C19,'lijst voedermiddelen'!$B$2:$N$198,3,FALSE)","v":0},{"$f":"VLOOKUP('vrouwelijk jongvee'!$C19,'lijst voedermiddelen'!$B$2:$N$198,4,FALSE)","v":0},{"$f":"VLOOKUP('vrouwelijk jongvee'!$C19,'lijst voedermiddelen'!$B$2:$N$198,5,FALSE)","v":0},{"$f":"VLOOKUP('vrouwelijk jongvee'!$C19,'lijst voedermiddelen'!$B$2:$N$198,6,FALSE)","v":0},{"$f":"VLOOKUP('vrouwelijk jongvee'!$C19,'lijst voedermiddelen'!$B$2:$N$198,7,FALSE)","v":0},null,0,{"$f":"IFERROR((VLOOKUP('vrouwelijk jongvee'!C19,'lijst voedermiddelen'!$B$2:$P$198,2,FALSE)/1000)*(((L$5*VLOOKUP('vrouwelijk jongvee'!C19,'lijst voedermiddelen'!$B$2:$P$198,3,FALSE))+(L$6*VLOOKUP('vrouwelijk jongvee'!$C19,'lijst voedermiddelen'!$B$2:$P$198,5,FALSE)))/1000)*(1-VLOOKUP('vrouwelijk jongvee'!$C19,'lijst voedermiddelen'!$B$2:$P$198,15,FALSE)/100)*10,\"-\")","v":0}]
[null,"voedermiddel12","(voedermiddel)",{"$f":"VLOOKUP('vrouwelijk jongvee'!$C20,'lijst voedermiddelen'!$B$2:$N$198,2,FALSE)","v":0},{"$f":"VLOOKUP('vrouwelijk jongvee'!$C20,'lijst voedermiddelen'!$B$2:$N$198,3,FALSE)","v":0},{"$f":"VLOOKUP('vrouwelijk jongvee'!$C20,'lijst voedermiddelen'!$B$2:$N$198,4,FALSE)","v":0},{"$f":"VLOOKUP('vrouwelijk jongvee'!$C20,'lijst voedermiddelen'!$B$2:$N$198,5,FALSE)","v":0},{"$f":"VLOOKUP('vrouwelijk jongvee'!$C20,'lijst voedermiddelen'!$B$2:$N$198,6,FALSE)","v":0},{"$f":"VLOOKUP('vrouwelijk jongvee'!$C20,'lijst voedermiddelen'!$B$2:$N$198,7,FALSE)","v":0},null,0,{"$f":"IFERROR((VLOOKUP('vrouwelijk jongvee'!C20,'lijst voedermiddelen'!$B$2:$P$198,2,FALSE)/1000)*(((L$5*VLOOKUP('vrouwelijk jongvee'!C20,'lijst voedermiddelen'!$B$2:$P$198,3,FALSE))+(L$6*VLOOKUP('vrouwelijk jongvee'!$C20,'lijst voedermiddelen'!$B$2:$P$198,5,FALSE)))/1000)*(1-VLOOKUP('vrouwelijk jongvee'!$C20,'lijst voedermiddelen'!$B$2:$P$198,15,FALSE)/100)*10,\"-\")","v":0}]
[null,"voedermiddel13","(voedermiddel)",{"$f":"VLOOKUP('vrouwelijk jongvee'!$C21,'lijst voedermiddelen'!$B$2:$N$198,2,FALSE)","v":0},{"$f":"VLOOKUP('vrouwelijk jongvee'!$C21,'lijst voedermiddelen'!$B$2:$N$198,3,FALSE)","v":0},{"$f":"VLOOKUP('vrouwelijk jongvee'!$C21,'lijst voedermiddelen'!$B$2:$N$198,4,FALSE)","v":0},{"$f":"VLOOKUP('vrouwelijk jongvee'!$C21,'lijst voedermiddelen'!$B$2:$N$198,5,FALSE)","v":0},{"$f":"VLOOKUP('vrouwelijk jongvee'!$C21,'lijst voedermiddelen'!$B$2:$N$198,6,FALSE)","v":0},{"$f":"VLOOKUP('vrouwelijk jongvee'!$C21,'lijst voedermiddelen'!$B$2:$N$198,7,FALSE)","v":0},null,0,{"$f":"IFERROR((VLOOKUP('vrouwelijk jongvee'!C21,'lijst voedermiddelen'!$B$2:$P$198,2,FALSE)/1000)*(((L$5*VLOOKUP('vrouwelijk jongvee'!C21,'lijst voedermiddelen'!$B$2:$P$198,3,FALSE))+(L$6*VLOOKUP('vrouwelijk jongvee'!$C21,'lijst voedermiddelen'!$B$2:$P$198,5,FALSE)))/1000)*(1-VLOOKUP('vrouwelijk jongvee'!$C21,'lijst voedermiddelen'!$B$2:$P$198,15,FALSE)/100)*10,\"-\")","v":0}]
[null,"voedermiddel14","(voedermiddel)",{"$f":"VLOOKUP('vrouwelijk jongvee'!$C22,'lijst voedermiddelen'!$B$2:$N$198,2,FALSE)","v":0},{"$f":"VLOOKUP('vrouwelijk jongvee'!$C22,'lijst voedermiddelen'!$B$2:$N$198,3,FALSE)","v":0},{"$f":"VLOOKUP('vrouwelijk jongvee'!$C22,'lijst voedermiddelen'!$B$2:$N$198,4,FALSE)","v":0},{"$f":"VLOOKUP('vrouwelijk jongvee'!$C22,'lijst voedermiddelen'!$B$2:$N$198,5,FALSE)","v":0},{"$f":"VLOOKUP('vrouwelijk jongvee'!$C22,'lijst voedermiddelen'!$B$2:$N$198,6,FALSE)","v":0},{"$f":"VLOOKUP('vrouwelijk jongvee'!$C22,'lijst voedermiddelen'!$B$2:$N$198,7,FALSE)","v":0},null,0,{"$f":"IFERROR((VLOOKUP('vrouwelijk jongvee'!C22,'lijst voedermiddelen'!$B$2:$P$198,2,FALSE)/1000)*(((L$5*VLOOKUP('vrouwelijk jongvee'!C22,'lijst voedermiddelen'!$B$2:$P$198,3,FALSE))+(L$6*VLOOKUP('vrouwelijk jongvee'!$C22,'lijst voedermiddelen'!$B$2:$P$198,5,FALSE)))/1000)*(1-VLOOKUP('vrouwelijk jongvee'!$C22,'lijst voedermiddelen'!$B$2:$P$198,15,FALSE)/100)*10,\"-\")","v":0}]
[null,"voedermiddel15","(voedermiddel)",{"$f":"VLOOKUP('vrouwelijk jongvee'!$C23,'lijst voedermiddelen'!$B$2:$N$198,2,FALSE)","v":0},{"$f":"VLOOKUP('vrouwelijk jongvee'!$C23,'lijst voedermiddelen'!$B$2:$N$198,3,FALSE)","v":0},{"$f":"VLOOKUP('vrouwelijk jongvee'!$C23,'lijst voedermiddelen'!$B$2:$N$198,4,FALSE)","v":0},{"$f":"VLOOKUP('vrouwelijk jongvee'!$C23,'lijst voedermiddelen'!$B$2:$N$198,5,FALSE)","v":0},{"$f":"VLOOKUP('vrouwelijk jongvee'!$C23,'lijst voedermiddelen'!$B$2:$N$198,6,FALSE)","v":0},{"$f":"VLOOKUP('vrouwelijk jongvee'!$C23,'lijst voedermiddelen'!$B$2:$N$198,7,FALSE)","v":0},null,0,{"$f":"IFERROR((VLOOKUP('vrouwelijk jongvee'!C23,'lijst voedermiddelen'!$B$2:$P$198,2,FALSE)/1000)*(((L$5*VLOOKUP('vrouwelijk jongvee'!C23,'lijst voedermiddelen'!$B$2:$P$198,3,FALSE))+(L$6*VLOOKUP('vrouwelijk jongvee'!$C23,'lijst voedermiddelen'!$B$2:$P$198,5,FALSE)))/1000)*(1-VLOOKUP('vrouwelijk jongvee'!$C23,'lijst voedermiddelen'!$B$2:$P$198,15,FALSE)/100)*10,\"-\")","v":0}]
[]
[]
[]
[null,null,"soort voedermiddel","SW              (/kg DS)","Ca                            (g/kg DS)","P                        (g/kg DS)","Mg                     (g/kg DS)","Na                        (g/kg DS)","K                        (g/kg DS)","VW                      (/kg DS)"]
[null,"voedermiddel1","(voedermiddel)",{"$f":"VLOOKUP('vrouwelijk jongvee'!$C28,'lijst voedermiddelen'!$B$2:$N$198,8,FALSE)","v":0},{"$f":"VLOOKUP('vrouwelijk jongvee'!$C28,'lijst voedermiddelen'!$B$2:$N$198,9,FALSE)","v":0},{"$f":"VLOOKUP('vrouwelijk jongvee'!$C28,'lijst voedermiddelen'!$B$2:$N$198,10,FALSE)","v":0},{"$f":"VLOOKUP('vrouwelijk jongvee'!$C28,'lijst voedermiddelen'!$B$2:$N$198,11,FALSE)","v":0},{"$f":"VLOOKUP('vrouwelijk jongvee'!$C28,'lijst voedermiddelen'!$B$2:$N$198,12,FALSE)","v":0},{"$f":"VLOOKUP('vrouwelijk jongvee'!$C28,'lijst voedermiddelen'!$B$2:$N$198,13,FALSE)","v":0},{"$f":"VLOOKUP('vrouwelijk jongvee'!$C28,'lijst voedermiddelen'!$B$2:$O$198,14,FALSE)","v":0}]
[null,"voedermiddel2","(voedermiddel)",{"$f":"VLOOKUP('vrouwelijk jongvee'!$C29,'lijst voedermiddelen'!$B$2:$N$198,8,FALSE)","v":0},{"$f":"VLOOKUP('vrouwelijk jongvee'!$C29,'lijst voedermiddelen'!$B$2:$N$198,9,FALSE)","v":0},{"$f":"VLOOKUP('vrouwelijk jongvee'!$C29,'lijst voedermiddelen'!$B$2:$N$198,10,FALSE)","v":0},{"$f":"VLOOKUP('vrouwelijk jongvee'!$C29,'lijst voedermiddelen'!$B$2:$N$198,11,FALSE)","v":0},{"$f":"VLOOKUP('vrouwelijk jongvee'!$C29,'lijst voedermiddelen'!$B$2:$N$198,12,FALSE)","v":0},{"$f":"VLOOKUP('vrouwelijk jongvee'!$C29,'lijst voedermiddelen'!$B$2:$N$198,13,FALSE)","v":0},{"$f":"VLOOKUP('vrouwelijk jongvee'!$C29,'lijst voedermiddelen'!$B$2:$O$198,14,FALSE)","v":0}]
[null,"voedermiddel3","(voedermiddel)",{"$f":"VLOOKUP('vrouwelijk jongvee'!$C30,'lijst voedermiddelen'!$B$2:$N$198,8,FALSE)","v":0},{"$f":"VLOOKUP('vrouwelijk jongvee'!$C30,'lijst voedermiddelen'!$B$2:$N$198,9,FALSE)","v":0},{"$f":"VLOOKUP('vrouwelijk jongvee'!$C30,'lijst voedermiddelen'!$B$2:$N$198,10,FALSE)","v":0},{"$f":"VLOOKUP('vrouwelijk jongvee'!$C30,'lijst voedermiddelen'!$B$2:$N$198,11,FALSE)","v":0},{"$f":"VLOOKUP('vrouwelijk jongvee'!$C30,'lijst voedermiddelen'!$B$2:$N$198,12,FALSE)","v":0},{"$f":"VLOOKUP('vrouwelijk jongvee'!$C30,'lijst voedermiddelen'!$B$2:$N$198,13,FALSE)","v":0},{"$f":"VLOOKUP('vrouwelijk jongvee'!$C30,'lijst voedermiddelen'!$B$2:$O$198,14,FALSE)","v":0}]
[null,"voedermiddel4","(voedermiddel)",{"$f":"VLOOKUP('vrouwelijk jongvee'!$C31,'lijst voedermiddelen'!$B$2:$N$198,8,FALSE)","v":0},{"$f":"VLOOKUP('vrouwelijk jongvee'!$C31,'lijst voedermiddelen'!$B$2:$N$198,9,FALSE)","v":0},{"$f":"VLOOKUP('vrouwelijk jongvee'!$C31,'lijst voedermiddelen'!$B$2:$N$198,10,FALSE)","v":0},{"$f":"VLOOKUP('vrouwelijk jongvee'!$C31,'lijst voedermiddelen'!$B$2:$N$198,11,FALSE)","v":0},{"$f":"VLOOKUP('vrouwelijk jongvee'!$C31,'lijst voedermiddelen'!$B$2:$N$198,12,FALSE)","v":0},{"$f":"VLOOKUP('vrouwelijk jongvee'!$C31,'lijst voedermiddelen'!$B$2:$N$198,13,FALSE)","v":0},{"$f":"VLOOKUP('vrouwelijk jongvee'!$C31,'lijst voedermiddelen'!$B$2:$O$198,14,FALSE)","v":0}]
[null,"voedermiddel5","(voedermiddel)",{"$f":"VLOOKUP('vrouwelijk jongvee'!$C32,'lijst voedermiddelen'!$B$2:$N$198,8,FALSE)","v":0},{"$f":"VLOOKUP('vrouwelijk jongvee'!$C32,'lijst voedermiddelen'!$B$2:$N$198,9,FALSE)","v":0},{"$f":"VLOOKUP('vrouwelijk jongvee'!$C32,'lijst voedermiddelen'!$B$2:$N$198,10,FALSE)","v":0},{"$f":"VLOOKUP('vrouwelijk jongvee'!$C32,'lijst voedermiddelen'!$B$2:$N$198,11,FALSE)","v":0},{"$f":"VLOOKUP('vrouwelijk jongvee'!$C32,'lijst voedermiddelen'!$B$2:$N$198,12,FALSE)","v":0},{"$f":"VLOOKUP('vrouwelijk jongvee'!$C32,'lijst voedermiddelen'!$B$2:$N$198,13,FALSE)","v":0},{"$f":"VLOOKUP('vrouwelijk jongvee'!$C32,'lijst voedermiddelen'!$B$2:$O$198,14,FALSE)","v":0}]
[null,"voedermiddel6","(voedermiddel)",{"$f":"VLOOKUP('vrouwelijk jongvee'!$C33,'lijst voedermiddelen'!$B$2:$N$198,8,FALSE)","v":0},{"$f":"VLOOKUP('vrouwelijk jongvee'!$C33,'lijst voedermiddelen'!$B$2:$N$198,9,FALSE)","v":0},{"$f":"VLOOKUP('vrouwelijk jongvee'!$C33,'lijst voedermiddelen'!$B$2:$N$198,10,FALSE)","v":0},{"$f":"VLOOKUP('vrouwelijk jongvee'!$C33,'lijst voedermiddelen'!$B$2:$N$198,11,FALSE)","v":0},{"$f":"VLOOKUP('vrouwelijk jongvee'!$C33,'lijst voedermiddelen'!$B$2:$N$198,12,FALSE)","v":0},{"$f":"VLOOKUP('vrouwelijk jongvee'!$C33,'lijst voedermiddelen'!$B$2:$N$198,13,FALSE)","v":0},{"$f":"VLOOKUP('vrouwelijk jongvee'!$C33,'lijst voedermiddelen'!$B$2:$O$198,14,FALSE)","v":0}]
[null,"voedermiddel7","(voedermiddel)",{"$f":"VLOOKUP('vrouwelijk jongvee'!$C34,'lijst voedermiddelen'!$B$2:$N$198,8,FALSE)","v":0},{"$f":"VLOOKUP('vrouwelijk jongvee'!$C34,'lijst voedermiddelen'!$B$2:$N$198,9,FALSE)","v":0},{"$f":"VLOOKUP('vrouwelijk jongvee'!$C34,'lijst voedermiddelen'!$B$2:$N$198,10,FALSE)","v":0},{"$f":"VLOOKUP('vrouwelijk jongvee'!$C34,'lijst voedermiddelen'!$B$2:$N$198,11,FALSE)","v":0},{"$f":"VLOOKUP('vrouwelijk jongvee'!$C34,'lijst voedermiddelen'!$B$2:$N$198,12,FALSE)","v":0},{"$f":"VLOOKUP('vrouwelijk jongvee'!$C34,'lijst voedermiddelen'!$B$2:$N$198,13,FALSE)","v":0},{"$f":"VLOOKUP('vrouwelijk jongvee'!$C34,'lijst voedermiddelen'!$B$2:$O$198,14,FALSE)","v":0}]
[null,"voedermiddel8","(voedermiddel)",{"$f":"VLOOKUP('vrouwelijk jongvee'!$C35,'lijst voedermiddelen'!$B$2:$N$198,8,FALSE)","v":0},{"$f":"VLOOKUP('vrouwelijk jongvee'!$C35,'lijst voedermiddelen'!$B$2:$N$198,9,FALSE)","v":0},{"$f":"VLOOKUP('vrouwelijk jongvee'!$C35,'lijst voedermiddelen'!$B$2:$N$198,10,FALSE)","v":0},{"$f":"VLOOKUP('vrouwelijk jongvee'!$C35,'lijst voedermiddelen'!$B$2:$N$198,11,FALSE)","v":0},{"$f":"VLOOKUP('vrouwelijk jongvee'!$C35,'lijst voedermiddelen'!$B$2:$N$198,12,FALSE)","v":0},{"$f":"VLOOKUP('vrouwelijk jongvee'!$C35,'lijst voedermiddelen'!$B$2:$N$198,13,FALSE)","v":0},{"$f":"VLOOKUP('vrouwelijk jongvee'!$C35,'lijst voedermiddelen'!$B$2:$O$198,14,FALSE)","v":0}]
[null,"voedermiddel9","(voedermiddel)",{"$f":"VLOOKUP('vrouwelijk jongvee'!$C36,'lijst voedermiddelen'!$B$2:$N$198,8,FALSE)","v":0},{"$f":"VLOOKUP('vrouwelijk jongvee'!$C36,'lijst voedermiddelen'!$B$2:$N$198,9,FALSE)","v":0},{"$f":"VLOOKUP('vrouwelijk jongvee'!$C36,'lijst voedermiddelen'!$B$2:$N$198,10,FALSE)","v":0},{"$f":"VLOOKUP('vrouwelijk jongvee'!$C36,'lijst voedermiddelen'!$B$2:$N$198,11,FALSE)","v":0},{"$f":"VLOOKUP('vrouwelijk jongvee'!$C36,'lijst voedermiddelen'!$B$2:$N$198,12,FALSE)","v":0},{"$f":"VLOOKUP('vrouwelijk jongvee'!$C36,'lijst voedermiddelen'!$B$2:$N$198,13,FALSE)","v":0},{"$f":"VLOOKUP('vrouwelijk jongvee'!$C36,'lijst voedermiddelen'!$B$2:$O$198,14,FALSE)","v":0}]
[null,"voedermiddel10","(voedermiddel)",{"$f":"VLOOKUP('vrouwelijk jongvee'!$C37,'lijst voedermiddelen'!$B$2:$N$198,8,FALSE)","v":0},{"$f":"VLOOKUP('vrouwelijk jongvee'!$C37,'lijst voedermiddelen'!$B$2:$N$198,9,FALSE)","v":0},{"$f":"VLOOKUP('vrouwelijk jongvee'!$C37,'lijst voedermiddelen'!$B$2:$N$198,10,FALSE)","v":0},{"$f":"VLOOKUP('vrouwelijk jongvee'!$C37,'lijst voedermiddelen'!$B$2:$N$198,11,FALSE)","v":0},{"$f":"VLOOKUP('vrouwelijk jongvee'!$C37,'lijst voedermiddelen'!$B$2:$N$198,12,FALSE)","v":0},{"$f":"VLOOKUP('vrouwelijk jongvee'!$C37,'lijst voedermiddelen'!$B$2:$N$198,13,FALSE)","v":0},{"$f":"VLOOKUP('vrouwelijk jongvee'!$C37,'lijst voedermiddelen'!$B$2:$O$198,14,FALSE)","v":0}]
[null,"voedermiddel11","(voedermiddel)",{"$f":"VLOOKUP('vrouwelijk jongvee'!$C38,'lijst voedermiddelen'!$B$2:$N$198,8,FALSE)","v":0},{"$f":"VLOOKUP('vrouwelijk jongvee'!$C38,'lijst voedermiddelen'!$B$2:$N$198,9,FALSE)","v":0},{"$f":"VLOOKUP('vrouwelijk jongvee'!$C38,'lijst voedermiddelen'!$B$2:$N$198,10,FALSE)","v":0},{"$f":"VLOOKUP('vrouwelijk jongvee'!$C38,'lijst voedermiddelen'!$B$2:$N$198,11,FALSE)","v":0},{"$f":"VLOOKUP('vrouwelijk jongvee'!$C38,'lijst voedermiddelen'!$B$2:$N$198,12,FALSE)","v":0},{"$f":"VLOOKUP('vrouwelijk jongvee'!$C38,'lijst voedermiddelen'!$B$2:$N$198,13,FALSE)","v":0},{"$f":"VLOOKUP('vrouwelijk jongvee'!$C38,'lijst voedermiddelen'!$B$2:$O$198,14,FALSE)","v":0}]
[null,"voedermiddel12","(voedermiddel)",{"$f":"VLOOKUP('vrouwelijk jongvee'!$C39,'lijst voedermiddelen'!$B$2:$N$198,8,FALSE)","v":0},{"$f":"VLOOKUP('vrouwelijk jongvee'!$C39,'lijst voedermiddelen'!$B$2:$N$198,9,FALSE)","v":0},{"$f":"VLOOKUP('vrouwelijk jongvee'!$C39,'lijst voedermiddelen'!$B$2:$N$198,10,FALSE)","v":0},{"$f":"VLOOKUP('vrouwelijk jongvee'!$C39,'lijst voedermiddelen'!$B$2:$N$198,11,FALSE)","v":0},{"$f":"VLOOKUP('vrouwelijk jongvee'!$C39,'lijst voedermiddelen'!$B$2:$N$198,12,FALSE)","v":0},{"$f":"VLOOKUP('vrouwelijk jongvee'!$C39,'lijst voedermiddelen'!$B$2:$N$198,13,FALSE)","v":0},{"$f":"VLOOKUP('vrouwelijk jongvee'!$C39,'lijst voedermiddelen'!$B$2:$O$198,14,FALSE)","v":0}]
[null,"voedermiddel13","(voedermiddel)",{"$f":"VLOOKUP('vrouwelijk jongvee'!$C40,'lijst voedermiddelen'!$B$2:$N$198,8,FALSE)","v":0},{"$f":"VLOOKUP('vrouwelijk jongvee'!$C40,'lijst voedermiddelen'!$B$2:$N$198,9,FALSE)","v":0},{"$f":"VLOOKUP('vrouwelijk jongvee'!$C40,'lijst voedermiddelen'!$B$2:$N$198,10,FALSE)","v":0},{"$f":"VLOOKUP('vrouwelijk jongvee'!$C40,'lijst voedermiddelen'!$B$2:$N$198,11,FALSE)","v":0},{"$f":"VLOOKUP('vrouwelijk jongvee'!$C40,'lijst voedermiddelen'!$B$2:$N$198,12,FALSE)","v":0},{"$f":"VLOOKUP('vrouwelijk jongvee'!$C40,'lijst voedermiddelen'!$B$2:$N$198,13,FALSE)","v":0},{"$f":"VLOOKUP('vrouwelijk jongvee'!$C40,'lijst voedermiddelen'!$B$2:$O$198,14,FALSE)","v":0}]
[null,"voedermiddel14","(voedermiddel)",{"$f":"VLOOKUP('vrouwelijk jongvee'!$C41,'lijst voedermiddelen'!$B$2:$N$198,8,FALSE)","v":0},{"$f":"VLOOKUP('vrouwelijk jongvee'!$C41,'lijst voedermiddelen'!$B$2:$N$198,9,FALSE)","v":0},{"$f":"VLOOKUP('vrouwelijk jongvee'!$C41,'lijst voedermiddelen'!$B$2:$N$198,10,FALSE)","v":0},{"$f":"VLOOKUP('vrouwelijk jongvee'!$C41,'lijst voedermiddelen'!$B$2:$N$198,11,FALSE)","v":0},{"$f":"VLOOKUP('vrouwelijk jongvee'!$C41,'lijst voedermiddelen'!$B$2:$N$198,12,FALSE)","v":0},{"$f":"VLOOKUP('vrouwelijk jongvee'!$C41,'lijst voedermiddelen'!$B$2:$N$198,13,FALSE)","v":0},{"$f":"VLOOKUP('vrouwelijk jongvee'!$C41,'lijst voedermiddelen'!$B$2:$O$198,14,FALSE)","v":0}]
[null,"voedermiddel15","(voedermiddel)",{"$f":"VLOOKUP('vrouwelijk jongvee'!$C42,'lijst voedermiddelen'!$B$2:$N$198,8,FALSE)","v":0},{"$f":"VLOOKUP('vrouwelijk jongvee'!$C42,'lijst voedermiddelen'!$B$2:$N$198,9,FALSE)","v":0},{"$f":"VLOOKUP('vrouwelijk jongvee'!$C42,'lijst voedermiddelen'!$B$2:$N$198,10,FALSE)","v":0},{"$f":"VLOOKUP('vrouwelijk jongvee'!$C42,'lijst voedermiddelen'!$B$2:$N$198,11,FALSE)","v":0},{"$f":"VLOOKUP('vrouwelijk jongvee'!$C42,'lijst voedermiddelen'!$B$2:$N$198,12,FALSE)","v":0},{"$f":"VLOOKUP('vrouwelijk jongvee'!$C42,'lijst voedermiddelen'!$B$2:$N$198,13,FALSE)","v":0},{"$f":"VLOOKUP('vrouwelijk jongvee'!$C42,'lijst voedermiddelen'!$B$2:$O$198,14,FALSE)","v":0}]
[]
[]
[]
[null,"rantsoen"]
[null,null,"soort voedermiddel","hoeveelheid verse stof (kg) ","kostprijs                     (€)","voederwaarde-prijs (€)"]
[null,"voedermiddel1",{"$f":"C9","v":"(voedermiddel)"},0,{"$f":"IF(AND(D48>0,K9=0),\"-\",D48*K9/1000)","v":0},{"$f":"IF(AND(D48>0,L9=\"-\"),\"-\",D48*L9/1000)","v":0}]
[null,"voedermiddel2",{"$f":"C10","v":"(voedermiddel)"},0,{"$f":"IF(AND(D49>0,K10=0),\"-\",D49*K10/1000)","v":0},{"$f":"IF(AND(D49>0,L10=\"-\"),\"-\",D49*L10/1000)","v":0}]
[null,"voedermiddel3",{"$f":"C11","v":"(voedermiddel)"},0,0,0]
[null,"voedermiddel4","(voedermiddel)",0,0,0]
[null,"voedermiddel5","(voedermiddel)",0,0,0]
[null,"voedermiddel6","(voedermiddel)",0,0,0]
[null,"voedermiddel7","(voedermiddel)",0,0,0]
[null,"voedermiddel8","(voedermiddel)",0,0,0]
[null,"voedermiddel9","(voedermiddel)",0,0,0]
[null,"voedermiddel10","(voedermiddel)",0,0,0]
[null,"voedermiddel11","(voedermiddel)",0,0,0]
[null,"voedermiddel12","(voedermiddel)",0,0,0]
[null,"voedermiddel13","(voedermiddel)",0,0,0]
[null,"voedermiddel14","(voedermiddel)",0,0,0]
[null,"voedermiddel15","(voedermiddel)",0,0,0]
[null,"totaal",null,{"$f":"SUM(D48:D62)","v":0},{"$f":"SUM(E48:E62)","v":0},{"$f":"SUM(F48:F62)","v":0}]
[]
[null,"voederwaarde rantsoen"]
[null,"hoeveelheid (kg VS)",null,"DS  (kg DS)","VEM ","DVE (g)","OEB (g)","RE (g)","SW "]
[null,{"$f":"D63","v":0},null,{"$f":"IF(COUNTIF($D$9:$D23,\"=-\")<>0,\"-\",SUMPRODUCT($D$48:$D$62,$D$9:$D$23)/1000)","v":0},{"$f":"IF(OR(COUNTIF($D$9:$D$23,\"=-\")<>0,COUNTIF(E9:E23,\"=-\")<>0),\"-\",SUMPRODUCT($D$48:$D$62,E9:E23,$D$9:$D$23)/1000)","v":0},{"$f":"IF(OR(COUNTIF($D$9:$D$23,\"=-\")<>0,COUNTIF(G9:G23,\"=-\")<>0),\"-\",SUMPRODUCT($D$48:$D$62,G9:G23,$D$9:$D$23)/1000)","v":0},{"$f":"IF(OR(COUNTIF($D$9:$D$23,\"=-\")<>0,COUNTIF(H9:H23,\"=-\")<>0),\"-\",SUMPRODUCT($D$48:$D$62,H9:H23,$D$9:$D$23)/1000)","v":0},{"$f":"IF(OR(COUNTIF($D$9:$D$23,\"=-\")<>0,COUNTIF(I9:I23,\"=-\")<>0),\"-\",SUMPRODUCT($D$48:$D$62,I9:I23,$D$9:$D$23)/1000)","v":0},{"$f":"IF(OR(COUNTIF($D$9:$D$23,\"=-\")<>0,COUNTIF(D28:D42,\"=-\")<>0),\"-\",SUMPRODUCT($D$48:$D$62,D28:D42,$D$9:$D$23)/1000)","v":0}]
[]
[null,null,null,"Ca (g)","P (g)","Mg (g)","Na (g)","K (g)","VW"]
[null,null,null,{"$f":"IF(OR(COUNTIF($D$9:$D$23,\"=-\")<>0,COUNTIF(E28:E42,\"=-\")<>0),\"-\",CEILING(SUMPRODUCT($D$48:$D$62,E28:E42,$D$9:$D$23)/1000,0.5))","v":0},0,0,0,0,0]
[]
[null,"kenmerken"]
[null,"leeftijd (maanden)"]
[]
[]
[null,"voederbehoeftenormen (per dier, per dag)"]
[null,"Energie","VEM ",{"$f":"DGET('voederbehoeftenormen '!$B$108:$I$115,5,$B$73:$B$74)","v":{"$error":"#NUM!"}}]
[null,"Eiwit","g DVE ",{"$f":"DGET('voederbehoeftenormen '!$B$108:$I$115,6,$B$73:$B$74)","v":{"$error":"#NUM!"}}]
[null,null,"g OEB* ",{"$f":"IF(F67>D78,DGET('voederbehoeftenormen '!$B$108:$I$115,7,$B$73:$B$74),0)","v":{"$error":"#NUM!"}},{"$f":"IF(F67>D78,(-(F67-D78)/0.65),0)","v":{"$error":"#NUM!"}}]
[null,"Mineralen","g Ca",{"$f":"IF(D67>0,DGET('voederbehoeftenormen '!$B$108:$M$115,9,$B$73:$B$74),\"afhankelijk van DS-opname\")","v":"afhankelijk van DS-opname"}]
[null,null,"g P ",{"$f":"IF(D67>0,DGET('voederbehoeftenormen '!$B$108:$M$115,10,$B$73:$B$74),\"afhankelijk van DS-opname\")","v":"afhankelijk van DS-opname"}]
[null,null,"g Mg ",{"$f":"DGET('voederbehoeftenormen '!$B$108:$M$115,11,$B$73:$B$74)","v":{"$error":"#NUM!"}}]
[null,"Structuur","SW ",{"$f":"IF(D67>0,DGET('voederbehoeftenormen '!$B$108:$I$115,8,$B$73:$B$74),\"afhankelijk van DS-opname\")","v":"afhankelijk van DS-opname"}]
[null,"* er bestaat geen OEB-norm, wel een ondergrens "]
[]
[]
[null,"hoeveelheid nodig om voederbehoeften te dekken",null,null,null,"kenmerken rantsoen"]
[null,null,null,"kg DS",null,"DS-gehalte (%)",null,{"$f":"(D67/B67)*100","v":{"$error":"#DIV/0!"}}]
[null,"op basis van ","VEM",{"$f":"CEILING(D77/(E67/D67),0.5)","v":{"$error":"#NUM!"}},null,"RE-gehalte (%)",null,{"$f":"(H67/(D67*1000))*100","v":{"$error":"#DIV/0!"}}]
[null,null,"DVE",{"$f":"CEILING(D78/(F67/D67),0.5)","v":{"$error":"#NUM!"}},null,"Structuurwaarde (per kg DS)",null,{"$f":"I67/D67","v":{"$error":"#DIV/0!"}}]
[null,null,null,null,null,"Verzadigingswaarde (per kg DS)",null,{"$f":"I70/D67","v":{"$error":"#DIV/0!"}}]
[]
[null,"opmerkingen"]
[null,"energie (VEM):",{"$f":"IF(AND(D67>0,E67<D77),\"Pas op! Rantsoen dekt energiebehoefte van dier niet\",\" \")","v":{"$error":"#NUM!"}}]
[null,"eiwit (DVE):",{"$f":"IF(AND(D67>0,F67<D78),\"Pas op! Rantsoen dekt eiwitbehoefte van dier niet. Dit impliceert dat het dier geen OEB-tekort verdraagt.\",\" \")","v":{"$error":"#NUM!"}}]
[null,"OEB:",{"$f":"IF(AND(G67>D79,G67>E79),\"\",\"Pas op! OEB-tekort: remming van de penswerking\")","v":{"$error":"#NUM!"}}]
[null,null,{"$f":"IF(OR(AND(CODE(B74)<48,G67>100)=TRUE,AND(CODE(B74)>48,G67>50)=TRUE),\"Er is een OEB-overmaat (d.w.z. N-uitscheiding in milieu), besparing op eiwit mogelijk!\",\" \")","v":{"$error":"#VALUE!"}}]
[null,"structuur:",{"$f":"IF(I67<0.95*D83,\"Pas op! Structuurtekort, gevaar voor pensverzuring\",\" \")","v":{"$error":"#VALUE!"}}]
[null,"ruw eiwitgehalte:",{"$f":"IF(OR(AND(CODE(B74)<48,H89<14.9)=TRUE,AND(CODE(B74)>48,H89<12.4)=TRUE),\"Ruw eiwitgehalte is laag: enkel probleem bij een groot OEB-tekort!\",\" \")","v":{"$error":"#VALUE!"}}]
[null,"mineralen:",{"$f":"IF(D70<(D80*0.95),\"Rantsoen dekt behoefte aan calcium niet: er is een tekort van \",\" \")","v":{"$error":"#VALUE!"}},null,null,null,{"$f":"IF(D70<D80*0.95,(D80-D70), \" \")","v":{"$error":"#VALUE!"}},{"$f":"IF(D70<D80*0.95,\"g per dier\", \" \")","v":{"$error":"#VALUE!"}}]
[null,null,{"$f":"IF(E70<(D81*0.95),\"Rantsoen dekt behoefte aan fosfor niet: er is een tekort van\",\" \")","v":{"$error":"#VALUE!"}},null,null,null,{"$f":"IF(E70<D81*0.95,(D81-E70), \" \")","v":{"$error":"#VALUE!"}},{"$f":"IF(E70<D81*0.95,\"g per dier\", \" \")","v":{"$error":"#VALUE!"}}]
[null,null,{"$f":"IF((D70/E70)<1.49,\"Slechte Ca/P-verhouding: overmaat aan P = kans op vorming van nier- en blaasstenen\",\" \")","v":{"$error":"#DIV/0!"}}]
[null,"kostprijs:",{"$f":"IF(COUNTIF($E$48:$E$62,\"=-\")<>0,\"De kostprijs van één of meerdere voedermiddelen ontbreken, de totale kostprijs van het rantsoen is niet volledig\",\"\")","v":""}]
[null,null,{"$f":"IF(COUNTIF($F$48:$F$62,\"=-\")<>0,\"De voederwaardeprijs van één of meerdere voedermiddelen ontbreken, ga na of de bewaarverliezen van deze voedermiddelen zijn ingevuld\",\"\")","v":""}]
[null,null,{"$f":"IF(OR(C103<>\"\",C104<>\"\"),\"\",IF(AND(E63>1.05*F63,F63>0),\"De kostprijs van het rantsoen is hoger dan de voederwaardeprijs: ga na of een goedkoper voedermiddel kan ingeschakeld worden.\",\" \"))","v":" "}]

{"sheet":"zoogkoeien","index":3,"n_rows":105,"n_cols":12,"rows_kept":105,"cut":false,"hidden":false,"merged":[[82,3,82,4],[76,3,76,4],[77,3,77,4],[79,3,79,4],[80,3,80,4],[81,3,81,4]]}
[]
[null,"zoogkoeien"]
[]
[null,null,null,null,null,null,null,null,null,null,"energieprijs en eiwittoeslagprijs (in eurocenten)"]
[null,"voedermiddelen",null,null,null,null,null,null,null,null,"per kVEM",0]
[null,null,null,null,null,null,null,null,null,null,"per kg DVE-toeslag",0]
[null,null,null,null,null,null,null,null,null,null,"datum"," "]
[null,null,"soort voedermiddel","DS                   (g DS/kg VS)","VEM               (/kg DS)","VEVI                           (/kg DS)","DVE                  (g/kg DS)","OEB               (g/kg DS)","RE                  (g/kg DS)",null,"kostprijs voeder-middel (€/ton VS)","voederwaardeprijs (€/ton VS)"]
[null,"voedermiddel1","(voedermiddel)",{"$f":"VLOOKUP(zoogkoeien!$C9,'lijst voedermiddelen'!$B$2:$N$198,2,FALSE)","v":0},{"$f":"VLOOKUP(zoogkoeien!$C9,'lijst voedermiddelen'!$B$2:$N$198,3,FALSE)","v":0},{"$f":"VLOOKUP(zoogkoeien!$C9,'lijst voedermiddelen'!$B$2:$N$198,4,FALSE)","v":0},{"$f":"VLOOKUP(zoogkoeien!$C9,'lijst voedermiddelen'!$B$2:$N$198,5,FALSE)","v":0},{"$f":"VLOOKUP(zoogkoeien!$C9,'lijst voedermiddelen'!$B$2:$N$198,6,FALSE)","v":0},{"$f":"VLOOKUP(zoogkoeien!$C9,'lijst voedermiddelen'!$B$2:$N$198,7,FALSE)","v":0},null,0,{"$f":"IFERROR((VLOOKUP(zoogkoeien!$C9,'lijst voedermiddelen'!$B$2:$P$198,2,FALSE)/1000)*(((L$5*VLOOKUP(zoogkoeien!$C9,'lijst voedermiddelen'!$B$2:$P$198,3,FALSE))+(L$6*VLOOKUP(zoogkoeien!$C9,'lijst voedermiddelen'!$B$2:$P$198,5,FALSE)))/1000)*(1-VLOOKUP(zoogkoeien!$C9,'lijst voedermiddelen'!$B$2:$P$198,15,FALSE)/100)*10,\"-\")","v":0}]
[null,"voedermiddel2","(voedermiddel)",{"$f":"VLOOKUP(zoogkoeien!$C10,'lijst voedermiddelen'!$B$2:$N$198,2,FALSE)","v":0},{"$f":"VLOOKUP(zoogkoeien!$C10,'lijst voedermiddelen'!$B$2:$N$198,3,FALSE)","v":0},{"$f":"VLOOKUP(zoogkoeien!$C10,'lijst voedermiddelen'!$B$2:$N$198,4,FALSE)","v":0},{"$f":"VLOOKUP(zoogkoeien!$C10,'lijst voedermiddelen'!$B$2:$N$198,5,FALSE)","v":0},{"$f":"VLOOKUP(zoogkoeien!$C10,'lijst voedermiddelen'!$B$2:$N$198,6,FALSE)","v":0},{"$f":"VLOOKUP(zoogkoeien!$C10,'lijst voedermiddelen'!$B$2:$N$198,7,FALSE)","v":0},null,0,{"$f":"IFERROR((VLOOKUP(zoogkoeien!$C10,'lijst voedermiddelen'!$B$2:$P$198,2,FALSE)/1000)*(((L$5*VLOOKUP(zoogkoeien!$C10,'lijst voedermiddelen'!$B$2:$P$198,3,FALSE))+(L$6*VLOOKUP(zoogkoeien!$C10,'lijst voedermiddelen'!$B$2:$P$198,5,FALSE)))/1000)*(1-VLOOKUP(zoogkoeien!$C10,'lijst voedermiddelen'!$B$2:$P$198,15,FALSE)/100)*10,\"-\")","v":0}]
[null,"voedermiddel3","(voedermiddel)",{"$f":"VLOOKUP(zoogkoeien!$C11,'lijst voedermiddelen'!$B$2:$N$198,2,FALSE)","v":0},{"$f":"VLOOKUP(zoogkoeien!$C11,'lijst voedermiddelen'!$B$2:$N$198,3,FALSE)","v":0},{"$f":"VLOOKUP(zoogkoeien!$C11,'lijst voedermiddelen'!$B$2:$N$198,4,FALSE)","v":0},{"$f":"VLOOKUP(zoogkoeien!$C11,'lijst voedermiddelen'!$B$2:$N$198,5,FALSE)","v":0},{"$f":"VLOOKUP(zoogkoeien!$C11,'lijst voedermiddelen'!$B$2:$N$198,6,FALSE)","v":0},{"$f":"VLOOKUP(zoogkoeien!$C11,'lijst voedermiddelen'!$B$2:$N$198,7,FALSE)","v":0},null,0,{"$f":"IFERROR((VLOOKUP(zoogkoeien!$C11,'lijst voedermiddelen'!$B$2:$P$198,2,FALSE)/1000)*(((L$5*VLOOKUP(zoogkoeien!$C11,'lijst voedermiddelen'!$B$2:$P$198,3,FALSE))+(L$6*VLOOKUP(zoogkoeien!$C11,'lijst voedermiddelen'!$B$2:$P$198,5,FALSE)))/1000)*(1-VLOOKUP(zoogkoeien!$C11,'lijst voedermiddelen'!$B$2:$P$198,15,FALSE)/100)*10,\"-\")","v":0}]
[null,"voedermiddel4","(voedermiddel)",{"$f":"VLOOKUP(zoogkoeien!$C12,'lijst voedermiddelen'!$B$2:$N$198,2,FALSE)","v":0},{"$f":"VLOOKUP(zoogkoeien!$C12,'lijst voedermiddelen'!$B$2:$N$198,3,FALSE)","v":0},{"$f":"VLOOKUP(zoogkoeien!$C12,'lijst voedermiddelen'!$B$2:$N$198,4,FALSE)","v":0},{"$f":"VLOOKUP(zoogkoeien!$C12,'lijst voedermiddelen'!$B$2:$N$198,5,FALSE)","v":0},{"$f":"VLOOKUP(zoogkoeien!$C12,'lijst voedermiddelen'!$B$2:$N$198,6,FALSE)","v":0},{"$f":"VLOOKUP(zoogkoeien!$C12,'lijst voedermiddelen'!$B$2:$N$198,7,FALSE)","v":0},null,0,{"$f":"IFERROR((VLOOKUP(zoogkoeien!$C12,'lijst voedermiddelen'!$B$2:$P$198,2,FALSE)/1000)*(((L$5*VLOOKUP(zoogkoeien!$C12,'lijst voedermiddelen'!$B$2:$P$198,3,FALSE))+(L$6*VLOOKUP(zoogkoeien!$C12,'lijst voedermiddelen'!$B$2:$P$198,5,FALSE)))/1000)*(1-VLOOKUP(zoogkoeien!$C12,'lijst voedermiddelen'!$B$2:$P$198,15,FALSE)/100)*10,\"-\")","v":0}]
[null,"voedermiddel5","(voedermiddel)",{"$f":"VLOOKUP(zoogkoeien!$C13,'lijst voedermiddelen'!$B$2:$N$198,2,FALSE)","v":0},{"$f":"VLOOKUP(zoogkoeien!$C13,'lijst voedermiddelen'!$B$2:$N$198,3,FALSE)","v":0},{"$f":"VLOOKUP(zoogkoeien!$C13,'lijst voedermiddelen'!$B$2:$N$198,4,FALSE)","v":0},{"$f":"VLOOKUP(zoogkoeien!$C13,'lijst voedermiddelen'!$B$2:$N$198,5,FALSE)","v":0},{"$f":"VLOOKUP(zoogkoeien!$C13,'lijst voedermiddelen'!$B$2:$N$198,6,FALSE)","v":0},{"$f":"VLOOKUP(zoogkoeien!$C13,'lijst voedermiddelen'!$B$2:$N$198,7,FALSE)","v":0},null,0,{"$f":"IFERROR((VLOOKUP(zoogkoeien!$C13,'lijst voedermiddelen'!$B$2:$P$198,2,FALSE)/1000)*(((L$5*VLOOKUP(zoogkoeien!$C13,'lijst voedermiddelen'!$B$2:$P$198,3,FALSE))+(L$6*VLOOKUP(zoogkoeien!$C13,'lijst voedermiddelen'!$B$2:$P$198,5,FALSE)))/1000)*(1-VLOOKUP(zoogkoeien!$C13,'lijst voedermiddelen'!$B$2:$P$198,15,FALSE)/100)*10,\"-\")","v":0}]
[null,"voedermiddel6","(voedermiddel)",{"$f":"VLOOKUP(zoogkoeien!$C14,'lijst voedermiddelen'!$B$2:$N$198,2,FALSE)","v":0},{"$f":"VLOOKUP(zoogkoeien!$C14,'lijst voedermiddelen'!$B$2:$N$198,3,FALSE)","v":0},{"$f":"VLOOKUP(zoogkoeien!$C14,'lijst voedermiddelen'!$B$2:$N$198,4,FALSE)","v":0},{"$f":"VLOOKUP(zoogkoeien!$C14,'lijst voedermiddelen'!$B$2:$N$198,5,FALSE)","v":0},{"$f":"VLOOKUP(zoogkoeien!$C14,'lijst voedermiddelen'!$B$2:$N$198,6,FALSE)","v":0},{"$f":"VLOOKUP(zoogkoeien!$C14,'lijst voedermiddelen'!$B$2:$N$198,7,FALSE)","v":0},null,0,{"$f":"IFERROR((VLOOKUP(zoogkoeien!$C14,'lijst voedermiddelen'!$B$2:$P$198,2,FALSE)/1000)*(((L$5*VLOOKUP(zoogkoeien!$C14,'lijst voedermiddelen'!$B$2:$P$198,3,FALSE))+(L$6*VLOOKUP(zoogkoeien!$C14,'lijst voedermiddelen'!$B$2:$P$198,5,FALSE)))/1000)*(1-VLOOKUP(zoogkoeien!$C14,'lijst voedermiddelen'!$B$2:$P$198,15,FALSE)/100)*10,\"-\")","v":0}]
[null,"voedermiddel7","(voedermiddel)",{"$f":"VLOOKUP(zoogkoeien!$C15,'lijst voedermiddelen'!$B$2:$N$198,2,FALSE)","v":0},{"$f":"VLOOKUP(zoogkoeien!$C15,'lijst voedermiddelen'!$B$2:$N$198,3,FALSE)","v":0},{"$f":"VLOOKUP(zoogkoeien!$C15,'lijst voedermiddelen'!$B$2:$N$198,4,FALSE)","v":0},{"$f":"VLOOKUP(zoogkoeien!$C15,'lijst voedermiddelen'!$B$2:$N$198,5,FALSE)","v":0},{"$f":"VLOOKUP(zoogkoeien!$C15,'lijst voedermiddelen'!$B$2:$N$198,6,FALSE)","v":0},{"$f":"VLOOKUP(zoogkoeien!$C15,'lijst voedermiddelen'!$B$2:$N$198,7,FALSE)","v":0},null,0,{"$f":"IFERROR((VLOOKUP(zoogkoeien!$C15,'lijst voedermiddelen'!$B$2:$P$198,2,FALSE)/1000)*(((L$5*VLOOKUP(zoogkoeien!$C15,'lijst voedermiddelen'!$B$2:$P$198,3,FALSE))+(L$6*VLOOKUP(zoogkoeien!$C15,'lijst voedermiddelen'!$B$2:$P$198,5,FALSE)))/1000)*(1-VLOOKUP(zoogkoeien!$C15,'lijst voedermiddelen'!$B$2:$P$198,15,FALSE)/100)*10,\"-\")","v":0}]
[null,"voedermiddel8","(voedermiddel)",{"$f":"VLOOKUP(zoogkoeien!$C16,'lijst voedermiddelen'!$B$2:$N$198,2,FALSE)","v":0},{"$f":"VLOOKUP(zoogkoeien!$C16,'lijst voedermiddelen'!$B$2:$N$198,3,FALSE)","v":0},{"$f":"VLOOKUP(zoogkoeien!$C16,'lijst voedermiddelen'!$B$2:$N$198,4,FALSE)","v":0},{"$f":"VLOOKUP(zoogkoeien!$C16,'lijst voedermiddelen'!$B$2:$N$198,5,FALSE)","v":0},{"$f":"VLOOKUP(zoogkoeien!$C16,'lijst voedermiddelen'!$B$2:$N$198,6,FALSE)","v":0},{"$f":"VLOOKUP(zoogkoeien!$C16,'lijst voedermiddelen'!$B$2:$N$198,7,FALSE)","v":0},null,0,{"$f":"IFERROR((VLOOKUP(zoogkoeien!$C16,'lijst voedermiddelen'!$B$2:$P$198,2,FALSE)/1000)*(((L$5*VLOOKUP(zoogkoeien!$C16,'lijst voedermiddelen'!$B$2:$P$198,3,FALSE))+(L$6*VLOOKUP(zoogkoeien!$C16,'lijst voedermiddelen'!$B$2:$P$198,5,FALSE)))/1000)*(1-VLOOKUP(zoogkoeien!$C16,'lijst voedermiddelen'!$B$2:$P$198,15,FALSE)/100)*10,\"-\")","v":0}]
[null,"voedermiddel9","(voedermiddel)",{"$f":"VLOOKUP(zoogkoeien!$C17,'lijst voedermiddelen'!$B$2:$N$198,2,FALSE)","v":0},{"$f":"VLOOKUP(zoogkoeien!$C17,'lijst voedermiddelen'!$B$2:$N$198,3,FALSE)","v":0},{"$f":"VLOOKUP(zoogkoeien!$C17,'lijst voedermiddelen'!$B$2:$N$198,4,FALSE)","v":0},{"$f":"VLOOKUP(zoogkoeien!$C17,'lijst voedermiddelen'!$B$2:$N$198,5,FALSE)","v":0},{"$f":"VLOOKUP(zoogkoeien!$C17,'lijst voedermiddelen'!$B$2:$N$198,6,FALSE)","v":0},{"$f":"VLOOKUP(zoogkoeien!$C17,'lijst voedermiddelen'!$B$2:$N$198,7,FALSE)","v":0},null,0,{"$f":"IFERROR((VLOOKUP(zoogkoeien!$C17,'lijst voedermiddelen'!$B$2:$P$198,2,FALSE)/1000)*(((L$5*VLOOKUP(zoogkoeien!$C17,'lijst voedermiddelen'!$B$2:$P$198,3,FALSE))+(L$6*VLOOKUP(zoogkoeien!$C17,'lijst voedermiddelen'!$B$2:$P$198,5,FALSE)))/1000)*(1-VLOOKUP(zoogkoeien!$C17,'lijst voedermiddelen'!$B$2:$P$198,15,FALSE)/100)*10,\"-\")","v":0}]
[null,"voedermiddel10","(voedermiddel)",{"$f":"VLOOKUP(zoogkoeien!$C18,'lijst voedermiddelen'!$B$2:$N$198,2,FALSE)","v":0},{"$f":"VLOOKUP(zoogkoeien!$C18,'lijst voedermiddelen'!$B$2:$N$198,3,FALSE)","v":0},{"$f":"VLOOKUP(zoogkoeien!$C18,'lijst voedermiddelen'!$B$2:$N$198,4,FALSE)","v":0},{"$f":"VLOOKUP(zoogkoeien!$C18,'lijst voedermiddelen'!$B$2:$N$198,5,FALSE)","v":0},{"$f":"VLOOKUP(zoogkoeien!$C18,'lijst voedermiddelen'!$B$2:$N$198,6,FALSE)","v":0},{"$f":"VLOOKUP(zoogkoeien!$C18,'lijst voedermiddelen'!$B$2:$N$198,7,FALSE)","v":0},null,0,{"$f":"IFERROR((VLOOKUP(zoogkoeien!$C18,'lijst voedermiddelen'!$B$2:$P$198,2,FALSE)/1000)*(((L$5*VLOOKUP(zoogkoeien!$C18,'lijst voedermiddelen'!$B$2:$P$198,3,FALSE))+(L$6*VLOOKUP(zoogkoeien!$C18,'lijst voedermiddelen'!$B$2:$P$198,5,FALSE)))/1000)*(1-VLOOKUP(zoogkoeien!$C18,'lijst voedermiddelen'!$B$2:$P$198,15,FALSE)/100)*10,\"-\")","v":0}]
[null,"voedermiddel11","(voedermiddel)",{"$f":"VLOOKUP(zoogkoeien!$C19,'lijst voedermiddelen'!$B$2:$N$198,2,FALSE)","v":0},{"$f":"VLOOKUP(zoogkoeien!$C19,'lijst voedermiddelen'!$B$2:$N$198,3,FALSE)","v":0},{"$f":"VLOOKUP(zoogkoeien!$C19,'lijst voedermiddelen'!$B$2:$N$198,4,FALSE)","v":0},{"$f":"VLOOKUP(zoogkoeien!$C19,'lijst voedermiddelen'!$B$2:$N$198,5,FALSE)","v":0},{"$f":"VLOOKUP(zoogkoeien!$C19,'lijst voedermiddelen'!$B$2:$N$198,6,FALSE)","v":0},{"$f":"VLOOKUP(zoogkoeien!$C19,'lijst voedermiddelen'!$B$2:$N$198,7,FALSE)","v":0},null,0,{"$f":"IFERROR((VLOOKUP(zoogkoeien!$C19,'lijst voedermiddelen'!$B$2:$P$198,2,FALSE)/1000)*(((L$5*VLOOKUP(zoogkoeien!$C19,'lijst voedermiddelen'!$B$2:$P$198,3,FALSE))+(L$6*VLOOKUP(zoogkoeien!$C19,'lijst voedermiddelen'!$B$2:$P$198,5,FALSE)))/1000)*(1-VLOOKUP(zoogkoeien!$C19,'lijst voedermiddelen'!$B$2:$P$198,15,FALSE)/100)*10,\"-\")","v":0}]
[null,"voedermiddel12","(voedermiddel)",{"$f":"VLOOKUP(zoogkoeien!$C20,'lijst voedermiddelen'!$B$2:$N$198,2,FALSE)","v":0},{"$f":"VLOOKUP(zoogkoeien!$C20,'lijst voedermiddelen'!$B$2:$N$198,3,FALSE)","v":0},{"$f":"VLOOKUP(zoogkoeien!$C20,'lijst voedermiddelen'!$B$2:$N$198,4,FALSE)","v":0},{"$f":"VLOOKUP(zoogkoeien!$C20,'lijst voedermiddelen'!$B$2:$N$198,5,FALSE)","v":0},{"$f":"VLOOKUP(zoogkoeien!$C20,'lijst voedermiddelen'!$B$2:$N$198,6,FALSE)","v":0},{"$f":"VLOOKUP(zoogkoeien!$C20,'lijst voedermiddelen'!$B$2:$N$198,7,FALSE)","v":0},null,0,{"$f":"IFERROR((VLOOKUP(zoogkoeien!$C20,'lijst voedermiddelen'!$B$2:$P$198,2,FALSE)/1000)*(((L$5*VLOOKUP(zoogkoeien!$C20,'lijst voedermiddelen'!$B$2:$P$198,3,FALSE))+(L$6*VLOOKUP(zoogkoeien!$C20,'lijst voedermiddelen'!$B$2:$P$198,5,FALSE)))/1000)*(1-VLOOKUP(zoogkoeien!$C20,'lijst voedermiddelen'!$B$2:$P$198,15,FALSE)/100)*10,\"-\")","v":0}]
[null,"voedermiddel13","(voedermiddel)",{"$f":"VLOOKUP(zoogkoeien!$C21,'lijst voedermiddelen'!$B$2:$N$198,2,FALSE)","v":0},{"$f":"VLOOKUP(zoogkoeien!$C21,'lijst voedermiddelen'!$B$2:$N$198,3,FALSE)","v":0},{"$f":"VLOOKUP(zoogkoeien!$C21,'lijst voedermiddelen'!$B$2:$N$198,4,FALSE)","v":0},{"$f":"VLOOKUP(zoogkoeien!$C21,'lijst voedermiddelen'!$B$2:$N$198,5,FALSE)","v":0},{"$f":"VLOOKUP(zoogkoeien!$C21,'lijst voedermiddelen'!$B$2:$N$198,6,FALSE)","v":0},{"$f":"VLOOKUP(zoogkoeien!$C21,'lijst voedermiddelen'!$B$2:$N$198,7,FALSE)","v":0},null,0,{"$f":"IFERROR((VLOOKUP(zoogkoeien!$C21,'lijst voedermiddelen'!$B$2:$P$198,2,FALSE)/1000)*(((L$5*VLOOKUP(zoogkoeien!$C21,'lijst voedermiddelen'!$B$2:$P$198,3,FALSE))+(L$6*VLOOKUP(zoogkoeien!$C21,'lijst voedermiddelen'!$B$2:$P$198,5,FALSE)))/1000)*(1-VLOOKUP(zoogkoeien!$C21,'lijst voedermiddelen'!$B$2:$P$198,15,FALSE)/100)*10,\"-\")","v":0}]
[null,"voedermiddel14","(voedermiddel)",{"$f":"VLOOKUP(zoogkoeien!$C22,'lijst voedermiddelen'!$B$2:$N$198,2,FALSE)","v":0},{"$f":"VLOOKUP(zoogkoeien!$C22,'lijst voedermiddelen'!$B$2:$N$198,3,FALSE)","v":0},{"$f":"VLOOKUP(zoogkoeien!$C22,'lijst voedermiddelen'!$B$2:$N$198,4,FALSE)","v":0},{"$f":"VLOOKUP(zoogkoeien!$C22,'lijst voedermiddelen'!$B$2:$N$198,5,FALSE)","v":0},{"$f":"VLOOKUP(zoogkoeien!$C22,'lijst voedermiddelen'!$B$2:$N$198,6,FALSE)","v":0},{"$f":"VLOOKUP(zoogkoeien!$C22,'lijst voedermiddelen'!$B$2:$N$198,7,FALSE)","v":0},null,0,{"$f":"IFERROR((VLOOKUP(zoogkoeien!$C22,'lijst voedermiddelen'!$B$2:$P$198,2,FALSE)/1000)*(((L$5*VLOOKUP(zoogkoeien!$C22,'lijst voedermiddelen'!$B$2:$P$198,3,FALSE))+(L$6*VLOOKUP(zoogkoeien!$C22,'lijst voedermiddelen'!$B$2:$P$198,5,FALSE)))/1000)*(1-VLOOKUP(zoogkoeien!$C22,'lijst voedermiddelen'!$B$2:$P$198,15,FALSE)/100)*10,\"-\")","v":0}]
[null,"voedermiddel15","(voedermiddel)",{"$f":"VLOOKUP(zoogkoeien!$C23,'lijst voedermiddelen'!$B$2:$N$198,2,FALSE)","v":0},{"$f":"VLOOKUP(zoogkoeien!$C23,'lijst voedermiddelen'!$B$2:$N$198,3,FALSE)","v":0},{"$f":"VLOOKUP(zoogkoeien!$C23,'lijst voedermiddelen'!$B$2:$N$198,4,FALSE)","v":0},{"$f":"VLOOKUP(zoogkoeien!$C23,'lijst voedermiddelen'!$B$2:$N$198,5,FALSE)","v":0},{"$f":"VLOOKUP(zoogkoeien!$C23,'lijst voedermiddelen'!$B$2:$N$198,6,FALSE)","v":0},{"$f":"VLOOKUP(zoogkoeien!$C23,'lijst voedermiddelen'!$B$2:$N$198,7,FALSE)","v":0},null,0,{"$f":"IFERROR((VLOOKUP(zoogkoeien!$C23,'lijst voedermiddelen'!$B$2:$P$198,2,FALSE)/1000)*(((L$5*VLOOKUP(zoogkoeien!$C23,'lijst voedermiddelen'!$B$2:$P$198,3,FALSE))+(L$6*VLOOKUP(zoogkoeien!$C23,'lijst voedermiddelen'!$B$2:$P$198,5,FALSE)))/1000)*(1-VLOOKUP(zoogkoeien!$C23,'lijst voedermiddelen'!$B$2:$P$198,15,FALSE)/100)*10,\"-\")","v":0}]
[]
[]
[]
[null,null,"soort voedermiddel","SW            (/kg DS)","Ca               (g/kg DS)","P               (g/kg DS)","Mg                     (g/kg DS)","Na                      (g/kg DS)","K                    (g/kg DS)","VW                       (/kg DS)"]
[null,"voedermiddel1","(voedermiddel)",{"$f":"VLOOKUP(zoogkoeien!$C28,'lijst voedermiddelen'!$B$2:$N$198,8,FALSE)","v":0},{"$f":"VLOOKUP(zoogkoeien!$C28,'lijst voedermiddelen'!$B$2:$N$198,9,FALSE)","v":0},{"$f":"VLOOKUP(zoogkoeien!$C28,'lijst voedermiddelen'!$B$2:$N$198,10,FALSE)","v":0},{"$f":"VLOOKUP(zoogkoeien!$C28,'lijst voedermiddelen'!$B$2:$N$198,11,FALSE)","v":0},{"$f":"VLOOKUP(zoogkoeien!$C28,'lijst voedermiddelen'!$B$2:$N$198,12,FALSE)","v":0},{"$f":"VLOOKUP(zoogkoeien!$C28,'lijst voedermiddelen'!$B$2:$N$198,13,FALSE)","v":0},{"$f":"VLOOKUP(zoogkoeien!$C28,'lijst voedermiddelen'!$B$2:$O$198,14,FALSE)","v":0}]
[null,"voedermiddel2","(voedermiddel)",{"$f":"VLOOKUP(zoogkoeien!$C29,'lijst voedermiddelen'!$B$2:$N$198,8,FALSE)","v":0},{"$f":"VLOOKUP(zoogkoeien!$C29,'lijst voedermiddelen'!$B$2:$N$198,9,FALSE)","v":0},{"$f":"VLOOKUP(zoogkoeien!$C29,'lijst voedermiddelen'!$B$2:$N$198,10,FALSE)","v":0},{"$f":"VLOOKUP(zoogkoeien!$C29,'lijst voedermiddelen'!$B$2:$N$198,11,FALSE)","v":0},{"$f":"VLOOKUP(zoogkoeien!$C29,'lijst voedermiddelen'!$B$2:$N$198,12,FALSE)","v":0},{"$f":"VLOOKUP(zoogkoeien!$C29,'lijst voedermiddelen'!$B$2:$N$198,13,FALSE)","v":0},{"$f":"VLOOKUP(zoogkoeien!$C29,'lijst voedermiddelen'!$B$2:$O$198,14,FALSE)","v":0}]
[null,"voedermiddel3","(voedermiddel)",{"$f":"VLOOKUP(zoogkoeien!$C30,'lijst voedermiddelen'!$B$2:$N$198,8,FALSE)","v":0},{"$f":"VLOOKUP(zoogkoeien!$C30,'lijst voedermiddelen'!$B$2:$N$198,9,FALSE)","v":0},{"$f":"VLOOKUP(zoogkoeien!$C30,'lijst voedermiddelen'!$B$2:$N$198,10,FALSE)","v":0},{"$f":"VLOOKUP(zoogkoeien!$C30,'lijst voedermiddelen'!$B$2:$N$198,11,FALSE)","v":0},{"$f":"VLOOKUP(zoogkoeien!$C30,'lijst voedermiddelen'!$B$2:$N$198,12,FALSE)","v":0},{"$f":"VLOOKUP(zoogkoeien!$C30,'lijst voedermiddelen'!$B$2:$N$198,13,FALSE)","v":0},{"$f":"VLOOKUP(zoogkoeien!$C30,'lijst voedermiddelen'!$B$2:$O$198,14,FALSE)","v":0}]
[null,"voedermiddel4","(voedermiddel)",{"$f":"VLOOKUP(zoogkoeien!$C31,'lijst voedermiddelen'!$B$2:$N$198,8,FALSE)","v":0},{"$f":"VLOOKUP(zoogkoeien!$C31,'lijst voedermiddelen'!$B$2:$N$198,9,FALSE)","v":0},{"$f":"VLOOKUP(zoogkoeien!$C31,'lijst voedermiddelen'!$B$2:$N$198,10,FALSE)","v":0},{"$f":"VLOOKUP(zoogkoeien!$C31,'lijst voedermiddelen'!$B$2:$N$198,11,FALSE)","v":0},{"$f":"VLOOKUP(zoogkoeien!$C31,'lijst voedermiddelen'!$B$2:$N$198,12,FALSE)","v":0},{"$f":"VLOOKUP(zoogkoeien!$C31,'lijst voedermiddelen'!$B$2:$N$198,13,FALSE)","v":0},{"$f":"VLOOKUP(zoogkoeien!$C31,'lijst voedermiddelen'!$B$2:$O$198,14,FALSE)","v":0}]
[null,"voedermiddel5","(voedermiddel)",{"$f":"VLOOKUP(zoogkoeien!$C32,'lijst voedermiddelen'!$B$2:$N$198,8,FALSE)","v":0},{"$f":"VLOOKUP(zoogkoeien!$C32,'lijst voedermiddelen'!$B$2:$N$198,9,FALSE)","v":0},{"$f":"VLOOKUP(zoogkoeien!$C32,'lijst voedermiddelen'!$B$2:$N$198,10,FALSE)","v":0},{"$f":"VLOOKUP(zoogkoeien!$C32,'lijst voedermiddelen'!$B$2:$N$198,11,FALSE)","v":0},{"$f":"VLOOKUP(zoogkoeien!$C32,'lijst voedermiddelen'!$B$2:$N$198,12,FALSE)","v":0},{"$f":"VLOOKUP(zoogkoeien!$C32,'lijst voedermiddelen'!$B$2:$N$198,13,FALSE)","v":0},{"$f":"VLOOKUP(zoogkoeien!$C32,'lijst voedermiddelen'!$B$2:$O$198,14,FALSE)","v":0}]
[null,"voedermiddel6","(voedermiddel)",{"$f":"VLOOKUP(zoogkoeien!$C33,'lijst voedermiddelen'!$B$2:$N$198,8,FALSE)","v":0},{"$f":"VLOOKUP(zoogkoeien!$C33,'lijst voedermiddelen'!$B$2:$N$198,9,FALSE)","v":0},{"$f":"VLOOKUP(zoogkoeien!$C33,'lijst voedermiddelen'!$B$2:$N$198,10,FALSE)","v":0},{"$f":"VLOOKUP(zoogkoeien!$C33,'lijst voedermiddelen'!$B$2:$N$198,11,FALSE)","v":0},{"$f":"VLOOKUP(zoogkoeien!$C33,'lijst voedermiddelen'!$B$2:$N$198,12,FALSE)","v":0},{"$f":"VLOOKUP(zoogkoeien!$C33,'lijst voedermiddelen'!$B$2:$N$198,13,FALSE)","v":0},{"$f":"VLOOKUP(zoogkoeien!$C33,'lijst voedermiddelen'!$B$2:$O$198,14,FALSE)","v":0}]
[null,"voedermiddel7","(voedermiddel)",{"$f":"VLOOKUP(zoogkoeien!$C34,'lijst voedermiddelen'!$B$2:$N$198,8,FALSE)","v":0},{"$f":"VLOOKUP(zoogkoeien!$C34,'lijst voedermiddelen'!$B$2:$N$198,9,FALSE)","v":0},{"$f":"VLOOKUP(zoogkoeien!$C34,'lijst voedermiddelen'!$B$2:$N$198,10,FALSE)","v":0},{"$f":"VLOOKUP(zoogkoeien!$C34,'lijst voedermiddelen'!$B$2:$N$198,11,FALSE)","v":0},{"$f":"VLOOKUP(zoogkoeien!$C34,'lijst voedermiddelen'!$B$2:$N$198,12,FALSE)","v":0},{"$f":"VLOOKUP(zoogkoeien!$C34,'lijst voedermiddelen'!$B$2:$N$198,13,FALSE)","v":0},{"$f":"VLOOKUP(zoogkoeien!$C34,'lijst voedermiddelen'!$B$2:$O$198,14,FALSE)","v":0}]
[null,"voedermiddel8","(voedermiddel)",{"$f":"VLOOKUP(zoogkoeien!$C35,'lijst voedermiddelen'!$B$2:$N$198,8,FALSE)","v":0},{"$f":"VLOOKUP(zoogkoeien!$C35,'lijst voedermiddelen'!$B$2:$N$198,9,FALSE)","v":0},{"$f":"VLOOKUP(zoogkoeien!$C35,'lijst voedermiddelen'!$B$2:$N$198,10,FALSE)","v":0},{"$f":"VLOOKUP(zoogkoeien!$C35,'lijst voedermiddelen'!$B$2:$N$198,11,FALSE)","v":0},{"$f":"VLOOKUP(zoogkoeien!$C35,'lijst voedermiddelen'!$B$2:$N$198,12,FALSE)","v":0},{"$f":"VLOOKUP(zoogkoeien!$C35,'lijst voedermiddelen'!$B$2:$N$198,13,FALSE)","v":0},{"$f":"VLOOKUP(zoogkoeien!$C35,'lijst voedermiddelen'!$B$2:$O$198,14,FALSE)","v":0}]
[null,"voedermiddel9","(voedermiddel)",{"$f":"VLOOKUP(zoogkoeien!$C36,'lijst voedermiddelen'!$B$2:$N$198,8,FALSE)","v":0},{"$f":"VLOOKUP(zoogkoeien!$C36,'lijst voedermiddelen'!$B$2:$N$198,9,FALSE)","v":0},{"$f":"VLOOKUP(zoogkoeien!$C36,'lijst voedermiddelen'!$B$2:$N$198,10,FALSE)","v":0},{"$f":"VLOOKUP(zoogkoeien!$C36,'lijst voedermiddelen'!$B$2:$N$198,11,FALSE)","v":0},{"$f":"VLOOKUP(zoogkoeien!$C36,'lijst voedermiddelen'!$B$2:$N$198,12,FALSE)","v":0},{"$f":"VLOOKUP(zoogkoeien!$C36,'lijst voedermiddelen'!$B$2:$N$198,13,FALSE)","v":0},{"$f":"VLOOKUP(zoogkoeien!$C36,'lijst voedermiddelen'!$B$2:$O$198,14,FALSE)","v":0}]
[null,"voedermiddel10","(voedermiddel)",{"$f":"VLOOKUP(zoogkoeien!$C37,'lijst voedermiddelen'!$B$2:$N$198,8,FALSE)","v":0},{"$f":"VLOOKUP(zoogkoeien!$C37,'lijst voedermiddelen'!$B$2:$N$198,9,FALSE)","v":0},{"$f":"VLOOKUP(zoogkoeien!$C37,'lijst voedermiddelen'!$B$2:$N$198,10,FALSE)","v":0},{"$f":"VLOOKUP(zoogkoeien!$C37,'lijst voedermiddelen'!$B$2:$N$198,11,FALSE)","v":0},{"$f":"VLOOKUP(zoogkoeien!$C37,'lijst voedermiddelen'!$B$2:$N$198,12,FALSE)","v":0},{"$f":"VLOOKUP(zoogkoeien!$C37,'lijst voedermiddelen'!$B$2:$N$198,13,FALSE)","v":0},{"$f":"VLOOKUP(zoogkoeien!$C37,'lijst voedermiddelen'!$B$2:$O$198,14,FALSE)","v":0}]
[null,"voedermiddel11","(voedermiddel)",{"$f":"VLOOKUP(zoogkoeien!$C38,'lijst voedermiddelen'!$B$2:$N$198,8,FALSE)","v":0},{"$f":"VLOOKUP(zoogkoeien!$C38,'lijst voedermiddelen'!$B$2:$N$198,9,FALSE)","v":0},{"$f":"VLOOKUP(zoogkoeien!$C38,'lijst voedermiddelen'!$B$2:$N$198,10,FALSE)","v":0},{"$f":"VLOOKUP(zoogkoeien!$C38,'lijst voedermiddelen'!$B$2:$N$198,11,FALSE)","v":0},{"$f":"VLOOKUP(zoogkoeien!$C38,'lijst voedermiddelen'!$B$2:$N$198,12,FALSE)","v":0},{"$f":"VLOOKUP(zoogkoeien!$C38,'lijst voedermiddelen'!$B$2:$N$198,13,FALSE)","v":0},{"$f":"VLOOKUP(zoogkoeien!$C38,'lijst voedermiddelen'!$B$2:$O$198,14,FALSE)","v":0}]
[null,"voedermiddel12","(voedermiddel)",{"$f":"VLOOKUP(zoogkoeien!$C39,'lijst voedermiddelen'!$B$2:$N$198,8,FALSE)","v":0},{"$f":"VLOOKUP(zoogkoeien!$C39,'lijst voedermiddelen'!$B$2:$N$198,9,FALSE)","v":0},{"$f":"VLOOKUP(zoogkoeien!$C39,'lijst voedermiddelen'!$B$2:$N$198,10,FALSE)","v":0},{"$f":"VLOOKUP(zoogkoeien!$C39,'lijst voedermiddelen'!$B$2:$N$198,11,FALSE)","v":0},{"$f":"VLOOKUP(zoogkoeien!$C39,'lijst voedermiddelen'!$B$2:$N$198,12,FALSE)","v":0},{"$f":"VLOOKUP(zoogkoeien!$C39,'lijst voedermiddelen'!$B$2:$N$198,13,FALSE)","v":0},{"$f":"VLOOKUP(zoogkoeien!$C39,'lijst voedermiddelen'!$B$2:$O$198,14,FALSE)","v":0}]
[null,"voedermiddel13","(voedermiddel)",{"$f":"VLOOKUP(zoogkoeien!$C40,'lijst voedermiddelen'!$B$2:$N$198,8,FALSE)","v":0},{"$f":"VLOOKUP(zoogkoeien!$C40,'lijst voedermiddelen'!$B$2:$N$198,9,FALSE)","v":0},{"$f":"VLOOKUP(zoogkoeien!$C40,'lijst voedermiddelen'!$B$2:$N$198,10,FALSE)","v":0},{"$f":"VLOOKUP(zoogkoeien!$C40,'lijst voedermiddelen'!$B$2:$N$198,11,FALSE)","v":0},{"$f":"VLOOKUP(zoogkoeien!$C40,'lijst voedermiddelen'!$B$2:$N$198,12,FALSE)","v":0},{"$f":"VLOOKUP(zoogkoeien!$C40,'lijst voedermiddelen'!$B$2:$N$198,13,FALSE)","v":0},{"$f":"VLOOKUP(zoogkoeien!$C40,'lijst voedermiddelen'!$B$2:$O$198,14,FALSE)","v":0}]
[null,"voedermiddel14","(voedermiddel)",{"$f":"VLOOKUP(zoogkoeien!$C41,'lijst voedermiddelen'!$B$2:$N$198,8,FALSE)","v":0},{"$f":"VLOOKUP(zoogkoeien!$C41,'lijst voedermiddelen'!$B$2:$N$198,9,FALSE)","v":0},{"$f":"VLOOKUP(zoogkoeien!$C41,'lijst voedermiddelen'!$B$2:$N$198,10,FALSE)","v":0},{"$f":"VLOOKUP(zoogkoeien!$C41,'lijst voedermiddelen'!$B$2:$N$198,11,FALSE)","v":0},{"$f":"VLOOKUP(zoogkoeien!$C41,'lijst voedermiddelen'!$B$2:$N$198,12,FALSE)","v":0},{"$f":"VLOOKUP(zoogkoeien!$C41,'lijst voedermiddelen'!$B$2:$N$198,13,FALSE)","v":0},{"$f":"VLOOKUP(zoogkoeien!$C41,'lijst voedermiddelen'!$B$2:$O$198,14,FALSE)","v":0}]
[null,"voedermiddel15","(voedermiddel)",{"$f":"VLOOKUP(zoogkoeien!$C42,'lijst voedermiddelen'!$B$2:$N$198,8,FALSE)","v":0},{"$f":"VLOOKUP(zoogkoeien!$C42,'lijst voedermiddelen'!$B$2:$N$198,9,FALSE)","v":0},{"$f":"VLOOKUP(zoogkoeien!$C42,'lijst voedermiddelen'!$B$2:$N$198,10,FALSE)","v":0},{"$f":"VLOOKUP(zoogkoeien!$C42,'lijst voedermiddelen'!$B$2:$N$198,11,FALSE)","v":0},{"$f":"VLOOKUP(zoogkoeien!$C42,'lijst voedermiddelen'!$B$2:$N$198,12,FALSE)","v":0},{"$f":"VLOOKUP(zoogkoeien!$C42,'lijst voedermiddelen'!$B$2:$N$198,13,FALSE)","v":0},{"$f":"VLOOKUP(zoogkoeien!$C42,'lijst voedermiddelen'!$B$2:$O$198,14,FALSE)","v":0}]
[]
[]
[]
[null,"rantsoen"]
[null,null,"soort voedermiddel","hoeveelheid (kg)","kostprijs                     (€)","voederwaarde-prijs (€)"]
[null,"voedermiddel1",{"$f":"C9","v":"(voedermiddel)"},0,{"$f":"IF(AND(D48>0,K9=0),\"-\",D48*K9/1000)","v":0},{"$f":"IF(AND(D48>0,L9=\"-\"),\"-\",D48*L9/1000)","v":0}]
[null,"voedermiddel2",{"$f":"C10","v":"(voedermiddel)"},0,{"$f":"IF(AND(D49>0,K10=0),\"-\",D49*K10/1000)","v":0},{"$f":"IF(AND(D49>0,L10=\"-\"),\"-\",D49*L10/1000)","v":0}]
[null,"voedermiddel3","(voedermiddel)",0,0,0]
[null,"voedermiddel4","(voedermiddel)",0,0,0]
[null,"voedermiddel5","(voedermiddel)",0,0,0]
[null,"voedermiddel6","(voedermiddel)",0,0,0]
[null,"voedermiddel7","(voedermiddel)",0,0,0]
[null,"voedermiddel8",{"$f":"C16","v":"(voedermiddel)"},0,0,0]
[null,"voedermiddel9",{"$f":"C17","v":"(voedermiddel)"},0,0,0]
[null,"voedermiddel10","(voedermiddel)",0,0,0]
[null,"voedermiddel11","(voedermiddel)",0,0,0]
[null,"voedermiddel12","(voedermiddel)",0,0,0]
[null,"voedermiddel13","(voedermiddel)",0,0,0]
[null,"voedermiddel14","(voedermiddel)",0,0,0]
[null,"voedermiddel15","(voedermiddel)",0,0,0]
[null,"totaal",null,{"$f":"SUM(D48:D62)","v":0},{"$f":"SUM(E48:E62)","v":0},{"$f":"SUM(F48:F62)","v":0}]
[]
[null,"voederwaarde rantsoen"]
[null,null,"hoeveelheid (kg VS)","DS  (kg DS)","VEM ","DVE (g)","OEB (g)","RE (g)","SW "]
[null,null,{"$f":"D63","v":0},{"$f":"IF(COUNTIF($D$9:$D$23,\"=-\")<>0,\"-\",SUMPRODUCT($D$48:$D$62,$D$9:$D$23)/1000)","v":0},{"$f":"IF(OR(COUNTIF($D$9:$D$23,\"=-\")<>0,COUNTIF(E9:E23,\"=-\")<>0),\"-\",SUMPRODUCT($D$48:$D$62,E9:E23,$D$9:$D$23)/1000)","v":0},{"$f":"IF(OR(COUNTIF($D$9:$D$23,\"=-\")<>0,COUNTIF(G9:G23,\"=-\")<>0),\"-\",SUMPRODUCT($D$48:$D$62,G9:G23,$D$9:$D$23)/1000)","v":0},{"$f":"IF(OR(COUNTIF($D$9:$D$23,\"=-\")<>0,COUNTIF(H9:H23,\"=-\")<>0),\"-\",SUMPRODUCT($D$48:$D$62,H9:H23,$D$9:$D$23)/1000)","v":0},{"$f":"IF(OR(COUNTIF($D$9:$D$23,\"=-\")<>0,COUNTIF(I9:I23,\"=-\")<>0),\"-\",SUMPRODUCT($D$48:$D$62,I9:I23,$D$9:$D$23)/1000)","v":0},{"$f":"IF(OR(COUNTIF($D$9:$D$23,\"=-\")<>0,COUNTIF(D28:D42,\"=-\")<>0),\"-\",SUMPRODUCT($D$48:$D$62,D28:D42,$D$9:$D$23)/1000)","v":0}]
[]
[null,null,null,"Ca (g)","P (g)","Mg (g)","Na (g)","K (g)","VW "]
[null,null,null,{"$f":"IF(OR(COUNTIF($D$9:$D$23,\"=-\")<>0,COUNTIF(E28:E42,\"=-\")<>0),\"-\",CEILING(SUMPRODUCT($D$48:$D$62,E28:E42,$D$9:$D$23)/1000,0.5))","v":0},0,0,0,0,0]
[]
[null,"kenmerken"]
[null,"kalving",null,"fysiologische toestand"]
[null," ",null," "]
[]
[null,"voederbehoeftenormen (per dier, per dag)"]
[null,"Energie","VEM ",{"$f":"DGET('voederbehoeftenormen '!$B$2:$G$17,3,$B$73:$D$74)","v":{"$error":"#VALUE!"}}]
[null,"Eiwit","g DVE",{"$f":"DGET('voederbehoeftenormen '!B$2:$G$17,4,$B$73:$D$74)","v":{"$error":"#VALUE!"}}]
[null,null,"g OEB* ",{"$f":"IF(F67>D78,DGET('voederbehoeftenormen '!$B$2:$G$17,5,$B$73:$D$74),0)","v":{"$error":"#VALUE!"}},{"$f":"IF(F67>D78,(-(F67-D78)/0.65),0)","v":{"$error":"#VALUE!"}}]
[null,"Mineralen","g Ca ",{"$f":"IF(D67>0,DGET('voederbehoeftenormen '!$B$2:$L$17,7,zoogkoeien!$B$73:$D$74),\"afhankelijk van DS-opname\")","v":"afhankelijk van DS-opname"}]
[null,null,"g P ",{"$f":"IF(D67>0,DGET('voederbehoeftenormen '!$B$2:$L$17,8,zoogkoeien!$B$73:$D$74),\"afhankelijk van DS-opname\")","v":"afhankelijk van DS-opname"}]
[null,null,"g Mg ",{"$f":"DGET('voederbehoeftenormen '!$B$2:$L$17,9,zoogkoeien!$B$73:$D$74)","v":{"$error":"#VALUE!"}}]
[null,"Structuur","SW ",{"$f":"IF(D67>0,DGET('voederbehoeftenormen '!$B$2:$G$17,6,$B$73:$D$74),\"afhankelijk van DS-opname\")","v":"afhankelijk van DS-opname"}]
[null,"* er bestaat geen OEB-norm, wel een ondergrens "]
[]
[]
[null,"hoeveelheid nodig om voederbehoeften te dekken",null,null,null,"kenmerken rantsoen"]
[null,null,null,"kg DS",null,"DS-gehalte (%)",null,{"$f":"(D67/C67)*100","v":{"$error":"#DIV/0!"}}]
[null,"op basis van ","VEM",{"$f":"CEILING(D77/(E67/D67),0.5)","v":{"$error":"#VALUE!"}},null,"RE-gehalte (%)",null,{"$f":"(H67/(D67*1000))*100","v":{"$error":"#DIV/0!"}}]
[null,null,"DVE",{"$f":"CEILING(D78/(F67/D67),0.5)","v":{"$error":"#VALUE!"}},null,"Structuurwaarde (per kg DS)",null,{"$f":"I67/D67","v":{"$error":"#DIV/0!"}}]
[null,null,null,null,null,"Verzadigingswaarde (per kg DS)",null,{"$f":"I70/D67","v":{"$error":"#DIV/0!"}}]
[]
[null,"opmerkingen"]
[null,"energie (VEM):",{"$f":"IF(AND(D67>0,E67<D77),\"Pas op! Rantsoen dekt energiebehoefte van dier niet\",\" \")","v":{"$error":"#VALUE!"}}]
[null,"eiwit (DVE):",{"$f":"IF(AND(D67>0,F67<D78),\"Pas op! Rantsoen dekt eiwitbehoefte van dier niet. Dit impliceert dat het dier geen OEB-tekort verdraagt.\",\" \")","v":{"$error":"#VALUE!"}}]
[null,"OEB:",{"$f":"IF(AND(G67>D79,G67>E79),\"\",\"Pas op! OEB-tekort: remming van de penswerking\")","v":{"$error":"#VALUE!"}}]
[null,null,{"$f":"IF(G67>50,\"Er is een OEB-overmaat (d.w.z. N-uitscheiding in milieu), besparing op eiwit mogelijk!\",\" \")","v":" "}]
[null,"structuur:",{"$f":"IF(I67<0.95*D83,\"Pas op! Structuurtekort: gevaar voor pensverzuring\",\" \")","v":{"$error":"#VALUE!"}}]
[null,"ruw eiwitgehalte:",{"$f":"IF(H89<11.9,\"Ruw eiwitgehalte is laag: enkel probleem bij een groot OEB-tekort!\",\" \")","v":{"$error":"#DIV/0!"}}]
[null,"mineralen:",{"$f":"IF(D70<(D80*0.95),\"Rantsoen dekt behoefte aan calcium niet: er is een tekort van \",\" \" )","v":{"$error":"#VALUE!"}},null,null,null,{"$f":"IF(D70<(D80*0.95),D80-D70,\" \" )","v":{"$error":"#VALUE!"}},{"$f":"IF(D70<(D80*0.95),\"g per dier\",\" \" )","v":{"$error":"#VALUE!"}}]
[null,null,{"$f":"IF(E70<(D81*0.95),\"Rantsoen dekt behoefte aan fosfor niet: er is een tekort van\",\" \")","v":{"$error":"#VALUE!"}},null,null,null,{"$f":"IF(E70<(D81*0.95),D81-E70,\" \" )","v":{"$error":"#VALUE!"}},{"$f":"IF(E70<(D81*0.95),\"g per dier\",\" \" )","v":{"$error":"#VALUE!"}}]
[null,null,{"$f":"IF((D70/E70)<1.49,\"Slechte Ca/P-verhouding: overmaat aan P = kans op vorming van nier- en blaasstenen\",\" \")","v":{"$error":"#DIV/0!"}}]
[null,"kostprijs:",{"$f":"IF(COUNTIF($E$48:$E$62,\"=-\")<>0,\"De kostprijs van één of meerdere voedermiddelen ontbreken, de totale kostprijs van het rantsoen is niet volledig\",\"\")","v":""}]
[null,null,{"$f":"IF(COUNTIF($F$48:$F$62,\"=-\")<>0,\"De voederwaardeprijs van één of meerdere voedermiddelen ontbreken, ga na of de bewaarverliezen van deze voedermiddelen zijn ingevuld\",\"\")","v":""}]
[null,null,{"$f":"IF(OR(C103<>\"\",C104<>\"\"),\"\",IF(AND(E63>1.05*F63,F63>0),\"De kostprijs van het rantsoen is hoger dan de voederwaardeprijs: ga na of een goedkoper voedermiddel kan ingeschakeld worden.\",\" \"))","v":" "}]

{"sheet":"stieren","index":4,"n_rows":106,"n_cols":13,"rows_kept":106,"cut":false,"hidden":false,"merged":[[82,3,82,4],[76,3,76,4],[77,3,77,4],[79,3,79,4],[80,3,80,4],[81,3,81,4]]}
[]
[null,"stieren"]
[]
[null,null,null,null,null,null,null,null,null,null,"energieprijs en eiwittoeslagprijs (in eurocenten)"]
[null,"voedermiddelen",null,null,null,null,null,null,null,null,"per kVEVI",0]
[null,null,null,null,null,null,null,null,null,null,"per kg DVE-toeslag",0]
[null,null,null,null,null,null,null,null,null,null,"datum"]
[null,null,"soort voedermiddel","DS                 (g DS/kg VS)","VEM                          (/kg DS)","VEVI                      (/kg DS)","DVE                       (g/kg DS)","OEB                  (g/kg DS)","RE                   (g/kg DS)",null,"kostprijs voeder-middel (€/ton VS)","voederwaardeprijs (€/ton VS)"]
[null,"voedermiddel1","(voedermiddel)",{"$f":"VLOOKUP(stieren!$C9,'lijst voedermiddelen'!$B$2:$N$198,2,FALSE)","v":0},{"$f":"VLOOKUP(stieren!$C9,'lijst voedermiddelen'!$B$2:$N$198,3,FALSE)","v":0},{"$f":"VLOOKUP(stieren!$C9,'lijst voedermiddelen'!$B$2:$N$198,4,FALSE)","v":0},{"$f":"VLOOKUP(stieren!$C9,'lijst voedermiddelen'!$B$2:$N$198,5,FALSE)","v":0},{"$f":"VLOOKUP(stieren!$C9,'lijst voedermiddelen'!$B$2:$N$198,6,FALSE)","v":0},{"$f":"VLOOKUP(stieren!$C9,'lijst voedermiddelen'!$B$2:$N$198,7,FALSE)","v":0},null,0,{"$f":"IFERROR((VLOOKUP(stieren!C9,'lijst voedermiddelen'!$B$2:$P$198,2,FALSE)/1000)*(((L$5*VLOOKUP(stieren!C9,'lijst voedermiddelen'!$B$2:$P$198,4,FALSE))+(L$6*VLOOKUP(stieren!$C9,'lijst voedermiddelen'!$B$2:$P$198,5,FALSE)))/1000)*(1-VLOOKUP(stieren!$C9,'lijst voedermiddelen'!$B$2:$P$198,15,FALSE)/100)*10,\"-\")","v":0}]
[null,"voedermiddel2","(voedermiddel)",{"$f":"VLOOKUP(stieren!$C10,'lijst voedermiddelen'!$B$2:$N$198,2,FALSE)","v":0},{"$f":"VLOOKUP(stieren!$C10,'lijst voedermiddelen'!$B$2:$N$198,3,FALSE)","v":0},{"$f":"VLOOKUP(stieren!$C10,'lijst voedermiddelen'!$B$2:$N$198,4,FALSE)","v":0},{"$f":"VLOOKUP(stieren!$C10,'lijst voedermiddelen'!$B$2:$N$198,5,FALSE)","v":0},{"$f":"VLOOKUP(stieren!$C10,'lijst voedermiddelen'!$B$2:$N$198,6,FALSE)","v":0},{"$f":"VLOOKUP(stieren!$C10,'lijst voedermiddelen'!$B$2:$N$198,7,FALSE)","v":0},null,0,{"$f":"IFERROR((VLOOKUP(stieren!C10,'lijst voedermiddelen'!$B$2:$P$198,2,FALSE)/1000)*(((L$5*VLOOKUP(stieren!C10,'lijst voedermiddelen'!$B$2:$P$198,4,FALSE))+(L$6*VLOOKUP(stieren!$C10,'lijst voedermiddelen'!$B$2:$P$198,5,FALSE)))/1000)*(1-VLOOKUP(stieren!$C10,'lijst voedermiddelen'!$B$2:$P$198,15,FALSE)/100)*10,\"-\")","v":0}]
[null,"voedermiddel3","(voedermiddel)",{"$f":"VLOOKUP(stieren!$C11,'lijst voedermiddelen'!$B$2:$N$198,2,FALSE)","v":0},{"$f":"VLOOKUP(stieren!$C11,'lijst voedermiddelen'!$B$2:$N$198,3,FALSE)","v":0},{"$f":"VLOOKUP(stieren!$C11,'lijst voedermiddelen'!$B$2:$N$198,4,FALSE)","v":0},{"$f":"VLOOKUP(stieren!$C11,'lijst voedermiddelen'!$B$2:$N$198,5,FALSE)","v":0},{"$f":"VLOOKUP(stieren!$C11,'lijst voedermiddelen'!$B$2:$N$198,6,FALSE)","v":0},{"$f":"VLOOKUP(stieren!$C11,'lijst voedermiddelen'!$B$2:$N$198,7,FALSE)","v":0},null,0,{"$f":"IFERROR((VLOOKUP(stieren!C11,'lijst voedermiddelen'!$B$2:$P$198,2,FALSE)/1000)*(((L$5*VLOOKUP(stieren!C11,'lijst voedermiddelen'!$B$2:$P$198,4,FALSE))+(L$6*VLOOKUP(stieren!$C11,'lijst voedermiddelen'!$B$2:$P$198,5,FALSE)))/1000)*(1-VLOOKUP(stieren!$C11,'lijst voedermiddelen'!$B$2:$P$198,15,FALSE)/100)*10,\"-\")","v":0}]
[null,"voedermiddel4","(voedermiddel)",{"$f":"VLOOKUP(stieren!$C12,'lijst voedermiddelen'!$B$2:$N$198,2,FALSE)","v":0},{"$f":"VLOOKUP(stieren!$C12,'lijst voedermiddelen'!$B$2:$N$198,3,FALSE)","v":0},{"$f":"VLOOKUP(stieren!$C12,'lijst voedermiddelen'!$B$2:$N$198,4,FALSE)","v":0},{"$f":"VLOOKUP(stieren!$C12,'lijst voedermiddelen'!$B$2:$N$198,5,FALSE)","v":0},{"$f":"VLOOKUP(stieren!$C12,'lijst voedermiddelen'!$B$2:$N$198,6,FALSE)","v":0},{"$f":"VLOOKUP(stieren!$C12,'lijst voedermiddelen'!$B$2:$N$198,7,FALSE)","v":0},null,0,{"$f":"IFERROR((VLOOKUP(stieren!C12,'lijst voedermiddelen'!$B$2:$P$198,2,FALSE)/1000)*(((L$5*VLOOKUP(stieren!C12,'lijst voedermiddelen'!$B$2:$P$198,4,FALSE))+(L$6*VLOOKUP(stieren!$C12,'lijst voedermiddelen'!$B$2:$P$198,5,FALSE)))/1000)*(1-VLOOKUP(stieren!$C12,'lijst voedermiddelen'!$B$2:$P$198,15,FALSE)/100)*10,\"-\")","v":0}]
[null,"voedermiddel5","(voedermiddel)",{"$f":"VLOOKUP(stieren!$C13,'lijst voedermiddelen'!$B$2:$N$198,2,FALSE)","v":0},{"$f":"VLOOKUP(stieren!$C13,'lijst voedermiddelen'!$B$2:$N$198,3,FALSE)","v":0},{"$f":"VLOOKUP(stieren!$C13,'lijst voedermiddelen'!$B$2:$N$198,4,FALSE)","v":0},{"$f":"VLOOKUP(stieren!$C13,'lijst voedermiddelen'!$B$2:$N$198,5,FALSE)","v":0},{"$f":"VLOOKUP(stieren!$C13,'lijst voedermiddelen'!$B$2:$N$198,6,FALSE)","v":0},{"$f":"VLOOKUP(stieren!$C13,'lijst voedermiddelen'!$B$2:$N$198,7,FALSE)","v":0},null,0,{"$f":"IFERROR((VLOOKUP(stieren!C13,'lijst voedermiddelen'!$B$2:$P$198,2,FALSE)/1000)*(((L$5*VLOOKUP(stieren!C13,'lijst voedermiddelen'!$B$2:$P$198,4,FALSE))+(L$6*VLOOKUP(stieren!$C13,'lijst voedermiddelen'!$B$2:$P$198,5,FALSE)))/1000)*(1-VLOOKUP(stieren!$C13,'lijst voedermiddelen'!$B$2:$P$198,15,FALSE)/100)*10,\"-\")","v":0},{"$f":"IF(L13>=0,\"\",\"vermoedelijk zijn de bewaarverliezen niet ingevuld\")","v":""}]
[null,"voedermiddel6","(voedermiddel)",{"$f":"VLOOKUP(stieren!$C14,'lijst voedermiddelen'!$B$2:$N$198,2,FALSE)","v":0},{"$f":"VLOOKUP(stieren!$C14,'lijst voedermiddelen'!$B$2:$N$198,3,FALSE)","v":0},{"$f":"VLOOKUP(stieren!$C14,'lijst voedermiddelen'!$B$2:$N$198,4,FALSE)","v":0},{"$f":"VLOOKUP(stieren!$C14,'lijst voedermiddelen'!$B$2:$N$198,5,FALSE)","v":0},{"$f":"VLOOKUP(stieren!$C14,'lijst voedermiddelen'!$B$2:$N$198,6,FALSE)","v":0},{"$f":"VLOOKUP(stieren!$C14,'lijst voedermiddelen'!$B$2:$N$198,7,FALSE)","v":0},null,0,{"$f":"IFERROR((VLOOKUP(stieren!C14,'lijst voedermiddelen'!$B$2:$P$198,2,FALSE)/1000)*(((L$5*VLOOKUP(stieren!C14,'lijst voedermiddelen'!$B$2:$P$198,4,FALSE))+(L$6*VLOOKUP(stieren!$C14,'lijst voedermiddelen'!$B$2:$P$198,5,FALSE)))/1000)*(1-VLOOKUP(stieren!$C14,'lijst voedermiddelen'!$B$2:$P$198,15,FALSE)/100)*10,\"-\")","v":0}]
[null,"voedermiddel7","(voedermiddel)",{"$f":"VLOOKUP(stieren!$C15,'lijst voedermiddelen'!$B$2:$N$198,2,FALSE)","v":0},{"$f":"VLOOKUP(stieren!$C15,'lijst voedermiddelen'!$B$2:$N$198,3,FALSE)","v":0},{"$f":"VLOOKUP(stieren!$C15,'lijst voedermiddelen'!$B$2:$N$198,4,FALSE)","v":0},{"$f":"VLOOKUP(stieren!$C15,'lijst voedermiddelen'!$B$2:$N$198,5,FALSE)","v":0},{"$f":"VLOOKUP(stieren!$C15,'lijst voedermiddelen'!$B$2:$N$198,6,FALSE)","v":0},{"$f":"VLOOKUP(stieren!$C15,'lijst voedermiddelen'!$B$2:$N$198,7,FALSE)","v":0},null,0,{"$f":"IFERROR((VLOOKUP(stieren!C15,'lijst voedermiddelen'!$B$2:$P$198,2,FALSE)/1000)*(((L$5*VLOOKUP(stieren!C15,'lijst voedermiddelen'!$B$2:$P$198,4,FALSE))+(L$6*VLOOKUP(stieren!$C15,'lijst voedermiddelen'!$B$2:$P$198,5,FALSE)))/1000)*(1-VLOOKUP(stieren!$C15,'lijst voedermiddelen'!$B$2:$P$198,15,FALSE)/100)*10,\"-\")","v":0}]
[null,"voedermiddel8","(voedermiddel)",{"$f":"VLOOKUP(stieren!$C16,'lijst voedermiddelen'!$B$2:$N$198,2,FALSE)","v":0},{"$f":"VLOOKUP(stieren!$C16,'lijst voedermiddelen'!$B$2:$N$198,3,FALSE)","v":0},{"$f":"VLOOKUP(stieren!$C16,'lijst voedermiddelen'!$B$2:$N$198,4,FALSE)","v":0},{"$f":"VLOOKUP(stieren!$C16,'lijst voedermiddelen'!$B$2:$N$198,5,FALSE)","v":0},{"$f":"VLOOKUP(stieren!$C16,'lijst voedermiddelen'!$B$2:$N$198,6,FALSE)","v":0},{"$f":"VLOOKUP(stieren!$C16,'lijst voedermiddelen'!$B$2:$N$198,7,FALSE)","v":0},null,0,{"$f":"IFERROR((VLOOKUP(stieren!C16,'lijst voedermiddelen'!$B$2:$P$198,2,FALSE)/1000)*(((L$5*VLOOKUP(stieren!C16,'lijst voedermiddelen'!$B$2:$P$198,4,FALSE))+(L$6*VLOOKUP(stieren!$C16,'lijst voedermiddelen'!$B$2:$P$198,5,FALSE)))/1000)*(1-VLOOKUP(stieren!$C16,'lijst voedermiddelen'!$B$2:$P$198,15,FALSE)/100)*10,\"-\")","v":0}]
[null,"voedermiddel9","(voedermiddel)",{"$f":"VLOOKUP(stieren!$C17,'lijst voedermiddelen'!$B$2:$N$198,2,FALSE)","v":0},{"$f":"VLOOKUP(stieren!$C17,'lijst voedermiddelen'!$B$2:$N$198,3,FALSE)","v":0},{"$f":"VLOOKUP(stieren!$C17,'lijst voedermiddelen'!$B$2:$N$198,4,FALSE)","v":0},{"$f":"VLOOKUP(stieren!$C17,'lijst voedermiddelen'!$B$2:$N$198,5,FALSE)","v":0},{"$f":"VLOOKUP(stieren!$C17,'lijst voedermiddelen'!$B$2:$N$198,6,FALSE)","v":0},{"$f":"VLOOKUP(stieren!$C17,'lijst voedermiddelen'!$B$2:$N$198,7,FALSE)","v":0},null,0,{"$f":"IFERROR((VLOOKUP(stieren!C17,'lijst voedermiddelen'!$B$2:$P$198,2,FALSE)/1000)*(((L$5*VLOOKUP(stieren!C17,'lijst voedermiddelen'!$B$2:$P$198,4,FALSE))+(L$6*VLOOKUP(stieren!$C17,'lijst voedermiddelen'!$B$2:$P$198,5,FALSE)))/1000)*(1-VLOOKUP(stieren!$C17,'lijst voedermiddelen'!$B$2:$P$198,15,FALSE)/100)*10,\"-\")","v":0}]
[null,"voedermiddel10","(voedermiddel)",{"$f":"VLOOKUP(stieren!$C18,'lijst voedermiddelen'!$B$2:$N$198,2,FALSE)","v":0},{"$f":"VLOOKUP(stieren!$C18,'lijst voedermiddelen'!$B$2:$N$198,3,FALSE)","v":0},{"$f":"VLOOKUP(stieren!$C18,'lijst voedermiddelen'!$B$2:$N$198,4,FALSE)","v":0},{"$f":"VLOOKUP(stieren!$C18,'lijst voedermiddelen'!$B$2:$N$198,5,FALSE)","v":0},{"$f":"VLOOKUP(stieren!$C18,'lijst voedermiddelen'!$B$2:$N$198,6,FALSE)","v":0},{"$f":"VLOOKUP(stieren!$C18,'lijst voedermiddelen'!$B$2:$N$198,7,FALSE)","v":0},null,0,{"$f":"IFERROR((VLOOKUP(stieren!C18,'lijst voedermiddelen'!$B$2:$P$198,2,FALSE)/1000)*(((L$5*VLOOKUP(stieren!C18,'lijst voedermiddelen'!$B$2:$P$198,4,FALSE))+(L$6*VLOOKUP(stieren!$C18,'lijst voedermiddelen'!$B$2:$P$198,5,FALSE)))/1000)*(1-VLOOKUP(stieren!$C18,'lijst voedermiddelen'!$B$2:$P$198,15,FALSE)/100)*10,\"-\")","v":0}]
[null,"voedermiddel11","(voedermiddel)",{"$f":"VLOOKUP(stieren!$C19,'lijst voedermiddelen'!$B$2:$N$198,2,FALSE)","v":0},{"$f":"VLOOKUP(stieren!$C19,'lijst voedermiddelen'!$B$2:$N$198,3,FALSE)","v":0},{"$f":"VLOOKUP(stieren!$C19,'lijst voedermiddelen'!$B$2:$N$198,4,FALSE)","v":0},{"$f":"VLOOKUP(stieren!$C19,'lijst voedermiddelen'!$B$2:$N$198,5,FALSE)","v":0},{"$f":"VLOOKUP(stieren!$C19,'lijst voedermiddelen'!$B$2:$N$198,6,FALSE)","v":0},{"$f":"VLOOKUP(stieren!$C19,'lijst voedermiddelen'!$B$2:$N$198,7,FALSE)","v":0},null,0,{"$f":"IFERROR((VLOOKUP(stieren!C19,'lijst voedermiddelen'!$B$2:$P$198,2,FALSE)/1000)*(((L$5*VLOOKUP(stieren!C19,'lijst voedermiddelen'!$B$2:$P$198,4,FALSE))+(L$6*VLOOKUP(stieren!$C19,'lijst voedermiddelen'!$B$2:$P$198,5,FALSE)))/1000)*(1-VLOOKUP(stieren!$C19,'lijst voedermiddelen'!$B$2:$P$198,15,FALSE)/100)*10,\"-\")","v":0}]
[null,"voedermiddel12","(voedermiddel)",{"$f":"VLOOKUP(stieren!$C20,'lijst voedermiddelen'!$B$2:$N$198,2,FALSE)","v":0},{"$f":"VLOOKUP(stieren!$C20,'lijst voedermiddelen'!$B$2:$N$198,3,FALSE)","v":0},{"$f":"VLOOKUP(stieren!$C20,'lijst voedermiddelen'!$B$2:$N$198,4,FALSE)","v":0},{"$f":"VLOOKUP(stieren!$C20,'lijst voedermiddelen'!$B$2:$N$198,5,FALSE)","v":0},{"$f":"VLOOKUP(stieren!$C20,'lijst voedermiddelen'!$B$2:$N$198,6,FALSE)","v":0},{"$f":"VLOOKUP(stieren!$C20,'lijst voedermiddelen'!$B$2:$N$198,7,FALSE)","v":0},null,0,{"$f":"IFERROR((VLOOKUP(stieren!C20,'lijst voedermiddelen'!$B$2:$P$198,2,FALSE)/1000)*(((L$5*VLOOKUP(stieren!C20,'lijst voedermiddelen'!$B$2:$P$198,4,FALSE))+(L$6*VLOOKUP(stieren!$C20,'lijst voedermiddelen'!$B$2:$P$198,5,FALSE)))/1000)*(1-VLOOKUP(stieren!$C20,'lijst voedermiddelen'!$B$2:$P$198,15,FALSE)/100)*10,\"-\")","v":0}]
[null,"voedermiddel13","(voedermiddel)",{"$f":"VLOOKUP(stieren!$C21,'lijst voedermiddelen'!$B$2:$N$198,2,FALSE)","v":0},{"$f":"VLOOKUP(stieren!$C21,'lijst voedermiddelen'!$B$2:$N$198,3,FALSE)","v":0},{"$f":"VLOOKUP(stieren!$C21,'lijst voedermiddelen'!$B$2:$N$198,4,FALSE)","v":0},{"$f":"VLOOKUP(stieren!$C21,'lijst voedermiddelen'!$B$2:$N$198,5,FALSE)","v":0},{"$f":"VLOOKUP(stieren!$C21,'lijst voedermiddelen'!$B$2:$N$198,6,FALSE)","v":0},{"$f":"VLOOKUP(stieren!$C21,'lijst voedermiddelen'!$B$2:$N$198,7,FALSE)","v":0},null,0,{"$f":"IFERROR((VLOOKUP(stieren!C21,'lijst voedermiddelen'!$B$2:$P$198,2,FALSE)/1000)*(((L$5*VLOOKUP(stieren!C21,'lijst voedermiddelen'!$B$2:$P$198,4,FALSE))+(L$6*VLOOKUP(stieren!$C21,'lijst voedermiddelen'!$B$2:$P$198,5,FALSE)))/1000)*(1-VLOOKUP(stieren!$C21,'lijst voedermiddelen'!$B$2:$P$198,15,FALSE)/100)*10,\"-\")","v":0}]
[null,"voedermiddel14","(voedermiddel)",{"$f":"VLOOKUP(stieren!$C22,'lijst voedermiddelen'!$B$2:$N$198,2,FALSE)","v":0},{"$f":"VLOOKUP(stieren!$C22,'lijst voedermiddelen'!$B$2:$N$198,3,FALSE)","v":0},{"$f":"VLOOKUP(stieren!$C22,'lijst voedermiddelen'!$B$2:$N$198,4,FALSE)","v":0},{"$f":"VLOOKUP(stieren!$C22,'lijst voedermiddelen'!$B$2:$N$198,5,FALSE)","v":0},{"$f":"VLOOKUP(stieren!$C22,'lijst voedermiddelen'!$B$2:$N$198,6,FALSE)","v":0},{"$f":"VLOOKUP(stieren!$C22,'lijst voedermiddelen'!$B$2:$N$198,7,FALSE)","v":0},null,0,{"$f":"IFERROR((VLOOKUP(stieren!C22,'lijst voedermiddelen'!$B$2:$P$198,2,FALSE)/1000)*(((L$5*VLOOKUP(stieren!C22,'lijst voedermiddelen'!$B$2:$P$198,4,FALSE))+(L$6*VLOOKUP(stieren!$C22,'lijst voedermiddelen'!$B$2:$P$198,5,FALSE)))/1000)*(1-VLOOKUP(stieren!$C22,'lijst voedermiddelen'!$B$2:$P$198,15,FALSE)/100)*10,\"-\")","v":0}]
[null,"voedermiddel15","(voedermiddel)",{"$f":"VLOOKUP(stieren!$C23,'lijst voedermiddelen'!$B$2:$N$198,2,FALSE)","v":0},{"$f":"VLOOKUP(stieren!$C23,'lijst voedermiddelen'!$B$2:$N$198,3,FALSE)","v":0},{"$f":"VLOOKUP(stieren!$C23,'lijst voedermiddelen'!$B$2:$N$198,4,FALSE)","v":0},{"$f":"VLOOKUP(stieren!$C23,'lijst voedermiddelen'!$B$2:$N$198,5,FALSE)","v":0},{"$f":"VLOOKUP(stieren!$C23,'lijst voedermiddelen'!$B$2:$N$198,6,FALSE)","v":0},{"$f":"VLOOKUP(stieren!$C23,'lijst voedermiddelen'!$B$2:$N$198,7,FALSE)","v":0},null,0,{"$f":"IFERROR((VLOOKUP(stieren!C23,'lijst voedermiddelen'!$B$2:$P$198,2,FALSE)/1000)*(((L$5*VLOOKUP(stieren!C23,'lijst voedermiddelen'!$B$2:$P$198,4,FALSE))+(L$6*VLOOKUP(stieren!$C23,'lijst voedermiddelen'!$B$2:$P$198,5,FALSE)))/1000)*(1-VLOOKUP(stieren!$C23,'lijst voedermiddelen'!$B$2:$P$198,15,FALSE)/100)*10,\"-\")","v":0}]
[]
[]
[]
[null,null,"soort voedermiddel","SW                  (/kg DS)","Ca             (g/kg DS)","P                (g/kg DS)","Mg                  (g/kg DS)","Na                  (g/kg DS)","K                       (g/kg DS)","VW                        (/kg DS)"]
[null,"voedermiddel1","(voedermiddel)",{"$f":"VLOOKUP(stieren!$C28,'lijst voedermiddelen'!$B$2:$N$198,8,FALSE)","v":0},{"$f":"VLOOKUP(stieren!$C28,'lijst voedermiddelen'!$B$2:$N$198,9,FALSE)","v":0},{"$f":"VLOOKUP(stieren!$C28,'lijst voedermiddelen'!$B$2:$N$198,10,FALSE)","v":0},{"$f":"VLOOKUP(stieren!$C28,'lijst voedermiddelen'!$B$2:$N$198,11,FALSE)","v":0},{"$f":"VLOOKUP(stieren!$C28,'lijst voedermiddelen'!$B$2:$N$198,12,FALSE)","v":0},{"$f":"VLOOKUP(stieren!$C28,'lijst voedermiddelen'!$B$2:$N$198,13,FALSE)","v":0},{"$f":"VLOOKUP(stieren!$C28,'lijst voedermiddelen'!$B$2:$O$198,14,FALSE)","v":0}]
[null,"voedermiddel2","(voedermiddel)",{"$f":"VLOOKUP(stieren!$C29,'lijst voedermiddelen'!$B$2:$N$198,8,FALSE)","v":0},{"$f":"VLOOKUP(stieren!$C29,'lijst voedermiddelen'!$B$2:$N$198,9,FALSE)","v":0},{"$f":"VLOOKUP(stieren!$C29,'lijst voedermiddelen'!$B$2:$N$198,10,FALSE)","v":0},{"$f":"VLOOKUP(stieren!$C29,'lijst voedermiddelen'!$B$2:$N$198,11,FALSE)","v":0},{"$f":"VLOOKUP(stieren!$C29,'lijst voedermiddelen'!$B$2:$N$198,12,FALSE)","v":0},{"$f":"VLOOKUP(stieren!$C29,'lijst voedermiddelen'!$B$2:$N$198,13,FALSE)","v":0},{"$f":"VLOOKUP(stieren!$C29,'lijst voedermiddelen'!$B$2:$O$198,14,FALSE)","v":0}]
[null,"voedermiddel3","(voedermiddel)",{"$f":"VLOOKUP(stieren!$C30,'lijst voedermiddelen'!$B$2:$N$198,8,FALSE)","v":0},{"$f":"VLOOKUP(stieren!$C30,'lijst voedermiddelen'!$B$2:$N$198,9,FALSE)","v":0},{"$f":"VLOOKUP(stieren!$C30,'lijst voedermiddelen'!$B$2:$N$198,10,FALSE)","v":0},{"$f":"VLOOKUP(stieren!$C30,'lijst voedermiddelen'!$B$2:$N$198,11,FALSE)","v":0},{"$f":"VLOOKUP(stieren!$C30,'lijst voedermiddelen'!$B$2:$N$198,12,FALSE)","v":0},{"$f":"VLOOKUP(stieren!$C30,'lijst voedermiddelen'!$B$2:$N$198,13,FALSE)","v":0},{"$f":"VLOOKUP(stieren!$C30,'lijst voedermiddelen'!$B$2:$O$198,14,FALSE)","v":0}]
[null,"voedermiddel4","(voedermiddel)",{"$f":"VLOOKUP(stieren!$C31,'lijst voedermiddelen'!$B$2:$N$198,8,FALSE)","v":0},{"$f":"VLOOKUP(stieren!$C31,'lijst voedermiddelen'!$B$2:$N$198,9,FALSE)","v":0},{"$f":"VLOOKUP(stieren!$C31,'lijst voedermiddelen'!$B$2:$N$198,10,FALSE)","v":0},{"$f":"VLOOKUP(stieren!$C31,'lijst voedermiddelen'!$B$2:$N$198,11,FALSE)","v":0},{"$f":"VLOOKUP(stieren!$C31,'lijst voedermiddelen'!$B$2:$N$198,12,FALSE)","v":0},{"$f":"VLOOKUP(stieren!$C31,'lijst voedermiddelen'!$B$2:$N$198,13,FALSE)","v":0},{"$f":"VLOOKUP(stieren!$C31,'lijst voedermiddelen'!$B$2:$O$198,14,FALSE)","v":0}]
[null,"voedermiddel5","(voedermiddel)",{"$f":"VLOOKUP(stieren!$C32,'lijst voedermiddelen'!$B$2:$N$198,8,FALSE)","v":0},{"$f":"VLOOKUP(stieren!$C32,'lijst voedermiddelen'!$B$2:$N$198,9,FALSE)","v":0},{"$f":"VLOOKUP(stieren!$C32,'lijst voedermiddelen'!$B$2:$N$198,10,FALSE)","v":0},{"$f":"VLOOKUP(stieren!$C32,'lijst voedermiddelen'!$B$2:$N$198,11,FALSE)","v":0},{"$f":"VLOOKUP(stieren!$C32,'lijst voedermiddelen'!$B$2:$N$198,12,FALSE)","v":0},{"$f":"VLOOKUP(stieren!$C32,'lijst voedermiddelen'!$B$2:$N$198,13,FALSE)","v":0},{"$f":"VLOOKUP(stieren!$C32,'lijst voedermiddelen'!$B$2:$O$198,14,FALSE)","v":0}]
[null,"voedermiddel6","(voedermiddel)",{"$f":"VLOOKUP(stieren!$C33,'lijst voedermiddelen'!$B$2:$N$198,8,FALSE)","v":0},{"$f":"VLOOKUP(stieren!$C33,'lijst voedermiddelen'!$B$2:$N$198,9,FALSE)","v":0},{"$f":"VLOOKUP(stieren!$C33,'lijst voedermiddelen'!$B$2:$N$198,10,FALSE)","v":0},{"$f":"VLOOKUP(stieren!$C33,'lijst voedermiddelen'!$B$2:$N$198,11,FALSE)","v":0},{"$f":"VLOOKUP(stieren!$C33,'lijst voedermiddelen'!$B$2:$N$198,12,FALSE)","v":0},{"$f":"VLOOKUP(stieren!$C33,'lijst voedermiddelen'!$B$2:$N$198,13,FALSE)","v":0},{"$f":"VLOOKUP(stieren!$C33,'lijst voedermiddelen'!$B$2:$O$198,14,FALSE)","v":0}]
[null,"voedermiddel7","(voedermiddel)",{"$f":"VLOOKUP(stieren!$C34,'lijst voedermiddelen'!$B$2:$N$198,8,FALSE)","v":0},{"$f":"VLOOKUP(stieren!$C34,'lijst voedermiddelen'!$B$2:$N$198,9,FALSE)","v":0},{"$f":"VLOOKUP(stieren!$C34,'lijst voedermiddelen'!$B$2:$N$198,10,FALSE)","v":0},{"$f":"VLOOKUP(stieren!$C34,'lijst voedermiddelen'!$B$2:$N$198,11,FALSE)","v":0},{"$f":"VLOOKUP(stieren!$C34,'lijst voedermiddelen'!$B$2:$N$198,12,FALSE)","v":0},{"$f":"VLOOKUP(stieren!$C34,'lijst voedermiddelen'!$B$2:$N$198,13,FALSE)","v":0},{"$f":"VLOOKUP(stieren!$C34,'lijst voedermiddelen'!$B$2:$O$198,14,FALSE)","v":0}]
[null,"voedermiddel8","(voedermiddel)",{"$f":"VLOOKUP(stieren!$C35,'lijst voedermiddelen'!$B$2:$N$198,8,FALSE)","v":0},{"$f":"VLOOKUP(stieren!$C35,'lijst voedermiddelen'!$B$2:$N$198,9,FALSE)","v":0},{"$f":"VLOOKUP(stieren!$C35,'lijst voedermiddelen'!$B$2:$N$198,10,FALSE)","v":0},{"$f":"VLOOKUP(stieren!$C35,'lijst voedermiddelen'!$B$2:$N$198,11,FALSE)","v":0},{"$f":"VLOOKUP(stieren!$C35,'lijst voedermiddelen'!$B$2:$N$198,12,FALSE)","v":0},{"$f":"VLOOKUP(stieren!$C35,'lijst voedermiddelen'!$B$2:$N$198,13,FALSE)","v":0},{"$f":"VLOOKUP(stieren!$C35,'lijst voedermiddelen'!$B$2:$O$198,14,FALSE)","v":0}]
[null,"voedermiddel9","(voedermiddel)",{"$f":"VLOOKUP(stieren!$C36,'lijst voedermiddelen'!$B$2:$N$198,8,FALSE)","v":0},{"$f":"VLOOKUP(stieren!$C36,'lijst voedermiddelen'!$B$2:$N$198,9,FALSE)","v":0},{"$f":"VLOOKUP(stieren!$C36,'lijst voedermiddelen'!$B$2:$N$198,10,FALSE)","v":0},{"$f":"VLOOKUP(stieren!$C36,'lijst voedermiddelen'!$B$2:$N$198,11,FALSE)","v":0},{"$f":"VLOOKUP(stieren!$C36,'lijst voedermiddelen'!$B$2:$N$198,12,FALSE)","v":0},{"$f":"VLOOKUP(stieren!$C36,'lijst voedermiddelen'!$B$2:$N$198,13,FALSE)","v":0},{"$f":"VLOOKUP(stieren!$C36,'lijst voedermiddelen'!$B$2:$O$198,14,FALSE)","v":0}]
[null,"voedermiddel10","(voedermiddel)",{"$f":"VLOOKUP(stieren!$C37,'lijst voedermiddelen'!$B$2:$N$198,8,FALSE)","v":0},{"$f":"VLOOKUP(stieren!$C37,'lijst voedermiddelen'!$B$2:$N$198,9,FALSE)","v":0},{"$f":"VLOOKUP(stieren!$C37,'lijst voedermiddelen'!$B$2:$N$198,10,FALSE)","v":0},{"$f":"VLOOKUP(stieren!$C37,'lijst voedermiddelen'!$B$2:$N$198,11,FALSE)","v":0},{"$f":"VLOOKUP(stieren!$C37,'lijst voedermiddelen'!$B$2:$N$198,12,FALSE)","v":0},{"$f":"VLOOKUP(stieren!$C37,'lijst voedermiddelen'!$B$2:$N$198,13,FALSE)","v":0},{"$f":"VLOOKUP(stieren!$C37,'lijst voedermiddelen'!$B$2:$O$198,14,FALSE)","v":0}]
[null,"voedermiddel11","(voedermiddel)",{"$f":"VLOOKUP(stieren!$C38,'lijst voedermiddelen'!$B$2:$N$198,8,FALSE)","v":0},{"$f":"VLOOKUP(stieren!$C38,'lijst voedermiddelen'!$B$2:$N$198,9,FALSE)","v":0},{"$f":"VLOOKUP(stieren!$C38,'lijst voedermiddelen'!$B$2:$N$198,10,FALSE)","v":0},{"$f":"VLOOKUP(stieren!$C38,'lijst voedermiddelen'!$B$2:$N$198,11,FALSE)","v":0},{"$f":"VLOOKUP(stieren!$C38,'lijst voedermiddelen'!$B$2:$N$198,12,FALSE)","v":0},{"$f":"VLOOKUP(stieren!$C38,'lijst voedermiddelen'!$B$2:$N$198,13,FALSE)","v":0},{"$f":"VLOOKUP(stieren!$C38,'lijst voedermiddelen'!$B$2:$O$198,14,FALSE)","v":0}]
[null,"voedermiddel12","(voedermiddel)",{"$f":"VLOOKUP(stieren!$C39,'lijst voedermiddelen'!$B$2:$N$198,8,FALSE)","v":0},{"$f":"VLOOKUP(stieren!$C39,'lijst voedermiddelen'!$B$2:$N$198,9,FALSE)","v":0},{"$f":"VLOOKUP(stieren!$C39,'lijst voedermiddelen'!$B$2:$N$198,10,FALSE)","v":0},{"$f":"VLOOKUP(stieren!$C39,'lijst voedermiddelen'!$B$2:$N$198,11,FALSE)","v":0},{"$f":"VLOOKUP(stieren!$C39,'lijst voedermiddelen'!$B$2:$N$198,12,FALSE)","v":0},{"$f":"VLOOKUP(stieren!$C39,'lijst voedermiddelen'!$B$2:$N$198,13,FALSE)","v":0},{"$f":"VLOOKUP(stieren!$C39,'lijst voedermiddelen'!$B$2:$O$198,14,FALSE)","v":0}]
[null,"voedermiddel13","(voedermiddel)",{"$f":"VLOOKUP(stieren!$C40,'lijst voedermiddelen'!$B$2:$N$198,8,FALSE)","v":0},{"$f":"VLOOKUP(stieren!$C40,'lijst voedermiddelen'!$B$2:$N$198,9,FALSE)","v":0},{"$f":"VLOOKUP(stieren!$C40,'lijst voedermiddelen'!$B$2:$N$198,10,FALSE)","v":0},{"$f":"VLOOKUP(stieren!$C40,'lijst voedermiddelen'!$B$2:$N$198,11,FALSE)","v":0},{"$f":"VLOOKUP(stieren!$C40,'lijst voedermiddelen'!$B$2:$N$198,12,FALSE)","v":0},{"$f":"VLOOKUP(stieren!$C40,'lijst voedermiddelen'!$B$2:$N$198,13,FALSE)","v":0},{"$f":"VLOOKUP(stieren!$C40,'lijst voedermiddelen'!$B$2:$O$198,14,FALSE)","v":0}]
[null,"voedermiddel14","(voedermiddel)",{"$f":"VLOOKUP(stieren!$C41,'lijst voedermiddelen'!$B$2:$N$198,8,FALSE)","v":0},{"$f":"VLOOKUP(stieren!$C41,'lijst voedermiddelen'!$B$2:$N$198,9,FALSE)","v":0},{"$f":"VLOOKUP(stieren!$C41,'lijst voedermiddelen'!$B$2:$N$198,10,FALSE)","v":0},{"$f":"VLOOKUP(stieren!$C41,'lijst voedermiddelen'!$B$2:$N$198,11,FALSE)","v":0},{"$f":"VLOOKUP(stieren!$C41,'lijst voedermiddelen'!$B$2:$N$198,12,FALSE)","v":0},{"$f":"VLOOKUP(stieren!$C41,'lijst voedermiddelen'!$B$2:$N$198,13,FALSE)","v":0},{"$f":"VLOOKUP(stieren!$C41,'lijst voedermiddelen'!$B$2:$O$198,14,FALSE)","v":0}]
[null,"voedermiddel15","(voedermiddel)",{"$f":"VLOOKUP(stieren!$C42,'lijst voedermiddelen'!$B$2:$N$198,8,FALSE)","v":0},{"$f":"VLOOKUP(stieren!$C42,'lijst voedermiddelen'!$B$2:$N$198,9,FALSE)","v":0},{"$f":"VLOOKUP(stieren!$C42,'lijst voedermiddelen'!$B$2:$N$198,10,FALSE)","v":0},{"$f":"VLOOKUP(stieren!$C42,'lijst voedermiddelen'!$B$2:$N$198,11,FALSE)","v":0},{"$f":"VLOOKUP(stieren!$C42,'lijst voedermiddelen'!$B$2:$N$198,12,FALSE)","v":0},{"$f":"VLOOKUP(stieren!$C42,'lijst voedermiddelen'!$B$2:$N$198,13,FALSE)","v":0},{"$f":"VLOOKUP(stieren!$C42,'lijst voedermiddelen'!$B$2:$O$198,14,FALSE)","v":0}]
[]
[]
[]
[null,"rantsoen"]
[null,null,"soort voedermiddel","hoeveelheid verse stof (kg)","kostprijs (€)","voederwaarde-prijs (€)"]
[null,"voedermiddel1",{"$f":"C9","v":"(voedermiddel)"},0,{"$f":"IF(AND(D48>0,K9=0),\"-\",D48*K9/1000)","v":0},{"$f":"IF(AND(D48>0,L9=\"-\"),\"-\",D48*L9/1000)","v":0}]
[null,"voedermiddel2",{"$f":"C10","v":"(voedermiddel)"},0,{"$f":"IF(AND(D49>0,K10=0),\"-\",D49*K10/1000)","v":0},{"$f":"IF(AND(D49>0,L10=\"-\"),\"-\",D49*L10/1000)","v":0}]
[null,"voedermiddel3","(voedermiddel)",0,0,0]
[null,"voedermiddel4","(voedermiddel)",0,0,0]
[null,"voedermiddel5","(voedermiddel)",0,0,0]
[null,"voedermiddel6","(voedermiddel)",0,0,0]
[null,"voedermiddel7","(voedermiddel)",0,0,0]
[null,"voedermiddel8","(voedermiddel)",0,0,0]
[null,"voedermiddel9","(voedermiddel)",0,0,0]
[null,"voedermiddel10",{"$f":"C18","v":"(voedermiddel)"},0,0,0]
[null,"voedermiddel11","(voedermiddel)",0,0,0]
[null,"voedermiddel12","(voedermiddel)",0,0,0]
[null,"voedermiddel13","(voedermiddel)",0,0,0]
[null,"voedermiddel14","(voedermiddel)",0,0,0]
[null,"voedermiddel15","(voedermiddel)",0,0,0]
[null,"totaal",null,{"$f":"SUM(D48:D62)","v":0},{"$f":"SUM(E48:E62)","v":0},{"$f":"SUM(F48:F62)","v":0}]
[]
[null,"voederwaarde rantsoen"]
[null,null,"hoeveelheid (kg VS)","DS  (kg DS)","VEVI","DVE (g)","OEB (g)","RE (g)","SW "]
[null,null,{"$f":"D63","v":0},{"$f":"IF(COUNTIF($D$9:$D$23,\"=-\")<>0,\"-\",SUMPRODUCT($D$48:$D$62,$D$9:$D$23)/1000)","v":0},{"$f":"IF(OR(COUNTIF($D$9:$D$23,\"=-\")<>0,COUNTIF(F9:F23,\"=-\")<>0),\"-\",SUMPRODUCT($D$48:$D$62,F9:F23,$D$9:$D$23)/1000)","v":0},{"$f":"IF(OR(COUNTIF($D$9:$D$23,\"=-\")<>0,COUNTIF(G9:G23,\"=-\")<>0),\"-\",SUMPRODUCT($D$48:$D$62,G9:G23,$D$9:$D$23)/1000)","v":0},{"$f":"IF(OR(COUNTIF($D$9:$D$23,\"=-\")<>0,COUNTIF(H9:H23,\"=-\")<>0),\"-\",SUMPRODUCT($D$48:$D$62,H9:H23,$D$9:$D$23)/1000)","v":0},{"$f":"IF(OR(COUNTIF($D$9:$D$23,\"=-\")<>0,COUNTIF(I9:I23,\"=-\")<>0),\"-\",SUMPRODUCT($D$48:$D$62,I9:I23,$D$9:$D$23)/1000)","v":0},{"$f":"IF(OR(COUNTIF($D$9:$D$23,\"=-\")<>0,COUNTIF(D28:D42,\"=-\")<>0),\"-\",SUMPRODUCT($D$48:$D$62,D28:D42,$D$9:$D$23)/1000)","v":0}]
[]
[null,null,null,"Ca (g)","P (g)","Mg (g)","Na (g)","K (g)","VW"]
[null,null,null,{"$f":"IF(OR(COUNTIF($D$9:$D$23,\"=-\")<>0,COUNTIF(E28:E42,\"=-\")<>0),\"-\",CEILING(SUMPRODUCT($D$48:$D$62,E28:E42,$D$9:$D$23)/1000,0.5))","v":0},0,0,0,0,0]
[]
[null,"kenmerken"]
[null,"gewicht (kg)",null,"groei (g/dag)"]
[null," ",null," "]
[]
[null,"voederbehoeftenormen (per dier, per dag)"]
[null,"Energie","VEVI  ",{"$f":"DGET('voederbehoeftenormen '!$B$22:$L$102,3,$B$73:$D$74)","v":{"$error":"#VALUE!"}}]
[null,"Eiwit","g DVE",{"$f":"DGET('voederbehoeftenormen '!$B$22:$L$102,4,$B$73:$D$74)","v":{"$error":"#VALUE!"}}]
[null,null,"g OEB*",{"$f":"IF(F67>D78,DGET('voederbehoeftenormen '!$B$22:$L$102,5,$B$73:$D$74),0)","v":{"$error":"#VALUE!"}},{"$f":"IF(F67>D78,(-(F67-D78)/0.65),0)","v":{"$error":"#VALUE!"}}]
[null,"Mineralen","g Ca",{"$f":"IF($D$67>0,DGET('voederbehoeftenormen '!$B$22:$L$102,7,$B$73:$D$74),\"afhankelijk van DS-opname\")","v":"afhankelijk van DS-opname"}]
[null,null,"g P ",{"$f":"IF($D$67>0,DGET('voederbehoeftenormen '!$B$22:$L$102,8,$B$73:$D$74),\"afhankelijk van DS-opname\")","v":"afhankelijk van DS-opname"}]
[null,null,"g Mg",{"$f":"DGET('voederbehoeftenormen '!$B$22:$L$102,9,$B$73:$D$74)","v":{"$error":"#VALUE!"}}]
[null,"Structuur","SW",{"$f":"IF(D67>0,DGET('voederbehoeftenormen '!$B$22:$L$102,6,$B$73:$D$74),\"afhankelijk van DS-opname\")","v":"afhankelijk van DS-opname"}]
[null,"* er bestaat geen OEB-norm, wel een ondergrens "]
[]
[]
[null,"hoeveelheid nodig om voederbehoeften te dekken",null,null,null,"kenmerken rantsoen"]
[null,null,null,"kg DS",null,"DS-gehalte (%)",null,{"$f":"(D67/C67)*100","v":{"$error":"#DIV/0!"}}]
[null,"op basis van ","VEVI",{"$f":"CEILING(D77/(E67/D67),0.5)","v":{"$error":"#VALUE!"}},null,"RE-gehalte (%)",null,{"$f":"(H67/(D67*1000))*100","v":{"$error":"#DIV/0!"}},null,null,{"$f":"OR(AND($B$74<460,$H$89<15.9)=TRUE,AND($B$74>460,$B$74<570,$H$89<14.4)=TRUE,AND($B$74>570,$H$89<11.9)=TRUE)","v":{"$error":"#DIV/0!"}}]
[null,null,"DVE",{"$f":"CEILING(D78/(F67/D67),0.5)","v":{"$error":"#VALUE!"}},null,"Structuurwaarde (per kg DS)",null,{"$f":"I67/D67","v":{"$error":"#DIV/0!"}}]
[null,null,null,null,null,"Verzadigingswaarde (per kg DS)",null,{"$f":"I70/D67","v":{"$error":"#DIV/0!"}}]
[]
[null,"opmerkingen"]
[null,"energie (VEVI):",{"$f":"IF(AND(D67>0,E67<D77),\"Pas op! Rantsoen dekt energiebehoefte van dier niet\",\" \")","v":{"$error":"#VALUE!"}}]
[null,"eiwit (DVE):",{"$f":"IF(AND(D67>0,F67<D78),\"Pas op! Rantsoen dekt eiwitbehoefte van dier niet. Dit impliceert dat het dier geen OEB-tekort verdraagt.\",\" \")","v":{"$error":"#VALUE!"}}]
[null,"OEB:",{"$f":"IF(AND(G67>D79,G67>E79),\"\",\"Pas op! OEB-tekort: remming van de penswerking\")","v":{"$error":"#VALUE!"}}]
[null,null,{"$f":"IF(G67>50,\"Er is een OEB-overmaat (d.w.z. N-uitscheiding in milieu), besparing op eiwit mogelijk!\",\" \")","v":" "}]
[null,"structuur:",{"$f":"IF(I67<D83*0.95,\"Pas op! Structuurtekort, gevaar voor pensverzuring\",\" \")","v":{"$error":"#VALUE!"}}]
[null,"droge stofgehalte:",{"$f":"IF(H88<35,\"Pas op! laag DS-gehalte: kans op lagere opneembaarheid rantsoen \",\" \")","v":{"$error":"#DIV/0!"}}]
[null,"ruw eiwitgehalte:",{"$f":"IF(K89=TRUE,\"Ruw eiwitgehalte is laag: enkel probleem bij te groot OEB-tekort!\",\"\")","v":{"$error":"#DIV/0!"}}]
[null,"mineralen:",{"$f":"IF((D70)<(D80*0.95),\"Rantsoen dekt behoefte aan calcium niet: er is een tekort van\",\" \")","v":{"$error":"#VALUE!"}},null,null,null,{"$f":"IF(D70<(D80*0.95),D80-D70,\" \")","v":{"$error":"#VALUE!"}},{"$f":"IF(D70<(D80*0.95),\"g per dier\",\" \")","v":{"$error":"#VALUE!"}}]
[null,null,{"$f":"IF((E70)<(D81*0.95),\"Rantsoen dekt behoefte aan fosfor niet: er is een tekort van\",\" \")","v":{"$error":"#VALUE!"}},null,null,null,{"$f":"IF(E70<(D81*0.95),D81-E70,\" \")","v":{"$error":"#VALUE!"}},{"$f":"IF(E70<(D81*0.95),\"g per dier\",\" \")","v":{"$error":"#VALUE!"}}]
[null,null,{"$f":"IF((D70/E70)<1.49,\"Pas op! Slechte Ca/P-verhouding: overmaat aan P = gevaar voor nier- en blaasstenen\",\" \")","v":{"$error":"#DIV/0!"}}]
[null,"kostprijs:",{"$f":"IF(COUNTIF($E$48:$E$62,\"=-\")<>0,\"De kostprijs van één of meerdere voedermiddelen ontbreken, de totale kostprijs van het rantsoen is niet volledig\",\" \")","v":" "}]
[null,null,{"$f":"IF(COUNTIF($F$48:$F$62,\"=-\")<>0,\"De voederwaardeprijs van één of meerdere voedermiddelen ontbreken, ga na of de bewaarverliezen van deze voedermiddellen zijn ingevuld \",\" \")","v":" "}]
[null,null,{"$f":"IF(OR(C104<>\" \",C105<>\" \"),\" \",IF(AND(E63>1.05*F63,F63>0),\"De kostprijs van het rantsoen is hoger dan de voederwaardeprijs: ga na of een goedkoper voedermiddel kan ingeschakeld worden.\",\"\"))","v":""}]

{"sheet":"lijst voedermiddelen","index":5,"n_rows":53,"n_cols":16,"rows_kept":53,"cut":false,"hidden":true,"merged":[]}
["Nr.","voedermiddel","DS  (g/kg VS)","VEM (/kg DS)","VEVI (/kg DS)","DVE (g/kg DS)","OEB (g/kg DS)","RE (g/kgDS)","SW (/kg DS)","Ca (g/kg DS)","P (g/kg DS)","Mg (g/kg DS)","Na (g/kg DS)","K (g/kg DS)","VW (/kg DS)","bewaarverliezen (%)"]
[{"$f":"ROW(A1)","v":1},"(voedermiddel)"]
[2,"aardappelen, vers ",199,1108,1226,69,-14,104,0.7,1.45,2.65,1.2,1.8,23.55,0.65,5]
[3,"aardappelsnippers",296,1227,1359,71,-25,92,0.48,0.46,2.02,0.48,1.25,12,0.56999999999999995,7]
[4,"aardappelstoomschillen",134,1099,1206,101,-22,132,0.45,1.56,2.68,1.1599999999999999,0.91,28.36,0.51,5]
[5,"bietenmelasse",725,1043,1152,74,78,142,-0.25,5.75,0.38,0.28000000000000003,7.76,59.9,0.34,0]
[6,"bietenvinasse",674,912,984,46,248,352,0.09,6.13,1.77,1.51,25.04,94,0.32,0]
[7,"CCM RC 40-60g/kg",593,1178,1294,80,-39,98,0.5,0.13,3.3,1.2,0.1,4.0999999999999996,0.71,5]
[8,"cichoreipulp",884,1023,1100,96,-68,90,0.28000000000000003,10.07,2.0099999999999998,1.47,1.73,9.99,0.43,0]
[9,"citruspulp",904,1068,1165,84,-73,69,0.2,13.33,1.33,1.38,0.55000000000000004,10.46,0.34,0]
[10,"draf, 27% DS ",269,953,949,147,24,228,0.95,4.5,6.27,1.9,0.9,0.8,0.55000000000000004,6]
[11,"droge bietenpulp",896,1009,1088,98,-52,107,0.31,10.72,0.9,2.02,1.92,12.47,0.36,0]
[12,"erwten, droog",869,1179,1292,120,68,241,0.11,1.1499999999999999,4.49,1.26,0.11,10.48,0.28999999999999998,0]
[13,"gerst",874,1116,1218,102,-49,113,-0.05,0.69,3.72,1.25,0.34,5.0999999999999996,0.28999999999999998,0]
[14,"gerstevoermeel",884,748,738,48,-2,122,0.33,2.94,2.99,2.4900000000000002,0.14000000000000001,11.44,0.36,0]
[15,"grashooi",845,790,789,57,14,136,3.61,5,4.2,"-","-",34.1,1.4,0]
[16,"graszaadhooi/ graszaadstro",844,583,529,21,-13,70,4.3,4.4000000000000004,1.7,"-","-",18.399999999999999,1.66,0]
[17,"katoenzaadschroot",908,873,867,185,144,400,0.44,2.2999999999999998,11.57,6.35,0.66,17.12,0.37,0]
[18,"kokosschilfers",922,1203,1303,163,3,222,0.42,0.96,6.08,3.32,0.64,23.33,0.34,0]
[19,"koolzaadkoek",894,1094,1154,140,148,362,0.31,7.05,12.08,4.7,0.22,13.2,0.35,0]
[20,"koolzaadschroot ",881,962,992,151,168,399,0.34,8.15,11.92,4.5,0.28000000000000003,14.11,0.34,0]
[21,"krijt",980,0,0,0,0,0,0,387.76,0,0,0,0,0,0]
[22,"lijnzaad",909,1892,2136,75,109,227,0.35,2.75,6.2,3.81,0.77,8.58,0.32,0]
[23,"lijnzaadschilfers",909,1121,1185,172,111,349,0.34,3.63,8.75,5.15,0.96,13.01,0.33,0]
[24,"luzernehooi",851,648,605,71,34,177,4.05,9.6,2.4,"-","-",23.3,1.4,0]
[25,"luzernepellets",911,706,683,73,14,168,0.56999999999999995,15.77,2.89,"-","-","-",0.39,0]
[26,"maïsglutenvoer ",891,1080,1157,102,81,239,0.36,1.65,9.8000000000000007,4.04,3.97,13.35,0.62,0]
[27,"maïskiemkoek (schilfers)",900,1063,1138,115,38,223,0.32,1.01,7.81,3.02,0.5,4.9000000000000004,0.62,0]
[28,"maïskiemschroot",884,1072,1147,118,37,245,0.35,0.47,6.71,1.7,0.77,3.47,0.62,0]
[29,"maïskuil",335.2,950,989.2,52,-36,75,1.57,1.5,2,1.2,0.2,12,0.82,7]
[30,"maniok",882,1038,1136,58,-85,26,-0.16,2.9,0.82,1.18,0.11,7.53,0.32,0]
[31,"milo",873,1156,1269,81,-38,95,0.21,0.44,3.21,1.49,0.17,4.28,0.31,0]
[32,"MKS",541,1134,1226,68,-27,93,0.75,0.4,2.5,0,0,5.5,0.74,5]
[{"$f":"ROW(A33)","v":33},"moutkiemen",911,918,946,83,93,241,0.26,2.14,5.91,1.45,0.38,13.34,0.36,0]
[34,"paardebonen",860,1172,1274,118,132,302,0.16,1.51,5.51,1.63,0.16,14.96,0.35,0]
[35,"palmpitschroot",879,909,932,124,-25,172,0.62,2.39,6.02,1.1499999999999999,0.11,3.16,0.39,0]
[36,"perspulp ",226,1070,1153,104,-64,104,1.05,8.35,0.95,2,0.6,5.95,0.7,4]
[37,"protifeed (DDGS)",923,1106,1154,141,134,346,0.38,1.1499999999999999,8.57,3.13,3.35,12.45,"-",0]
[38,"protistar",330,1010,"-",168,68,320,"-","-",4.5999999999999996,"-",0.7,4.8,"-",4]
[39,"protisyr",300,1125,1206,168,136,350,"-",1.1000000000000001,12.8,5.3,11,22.5,"-",4]
[40,"protiwanze",270,1123,1204,157,94,300,"-",1.5,6.4,1.7,2.2999999999999998,13.5,"-",4]
[41,"sojaschroot",878,1154,1237,264,197,506,0.25,3.39,7.28,3.26,0.25,25.97,0.28999999999999998,0]
[42,"spelt",872,935,974,72,-3,123,0.18,0.43,3.82,1.31,0.17,4.72,"-",0]
[43,"tarwe ",855,1158,1275,95,-21,124,-0.11,0.47,3.78,1.05,0.12,5.15,0.31,0]
[44,"tarweferm",325,1128,1225,147,55,275,0.15,1.9,12.5,"-",15.2,16.100000000000001,"-",4]
[45,"tarweglutenvoer, gedroogd",905,987,1038,89,26,177,0.15,1.6,9.64,2.96,4.88,14.04,0.32,0]
[46,"tarwestro",902,418,336,-4,-17,44,4.3,4.3,1.1000000000000001,"-","-",17.5,1.66,0]
[47,"triticale",871,1191,1320,90,-20,123,-0.13,0.46,3.79,1.21,0.11,5.86,0.31,0]
[48,"vers gras ",157,1005,1060,97,77,227,1.89,5.8,4.3,"-","-",36.6,0.89,"-"]
[49,"voederbieten",147,1049,1163,95,-93,88,1.05,1.45,1.9,"-","-",23.77,0.69,10]
[50,"voordroogkuil",452,897,927,67,58,173,2.89,5.08,4.12,1.9,1.9,34.28,1.01,15]
[51,"witloofwortelen",157,1018,1120,77,-83,59,0.93,3.2,1.77,"-","-",17.87,0.69,5]
[52,"zemelen/kortmeel",876,879,897,76,35,178,0.3,2.11,13.13,3.13,0.18,14.95,0.33,0]

{"sheet":"rekenblad","index":6,"n_rows":40,"n_cols":9,"rows_kept":40,"cut":false,"hidden":false,"merged":[]}
[null,"box:",null,"hoeveelheid (kg)"]
[null,"aantal dieren:",null,"voor alle dieren","per dier"]
[null,"voedermiddel 1:",null,null,{"$f":"D3/$C$2","v":{"$error":"#DIV/0!"}}]
[null,"voedermiddel 2:",null,null,{"$f":"D4/$C$2","v":{"$error":"#DIV/0!"}}]
[null,"voedermiddel 3:",null,null,{"$f":"D5/$C$2","v":{"$error":"#DIV/0!"}}]
[null,"voedermiddel 4:",null,null,{"$f":"D6/$C$2","v":{"$error":"#DIV/0!"}}]
[null,"voedermiddel 5:",null,null,{"$f":"D7/$C$2","v":{"$error":"#DIV/0!"}}]
[null,"voedermiddel 6:",null,null,{"$error":"#DIV/0!"}]
[null,"voedermiddel 7:",null,null,{"$error":"#DIV/0!"}]
[null,"voedermiddel 8:",null,null,{"$error":"#DIV/0!"}]
[null,"voedermiddel 9:",null,null,{"$error":"#DIV/0!"}]
[null,"voedermiddel 10:",null,null,{"$error":"#DIV/0!"}]
[null,"voedermiddel 11:",null,null,{"$error":"#DIV/0!"}]
[null,"voedermiddel 12:",null,null,{"$error":"#DIV/0!"}]
[null,"voedermiddel 13:",null,null,{"$error":"#DIV/0!"}]
[null,"voedermiddel 14:",null,null,{"$error":"#DIV/0!"}]
[null,"voedermiddel 15:",null,null,{"$error":"#DIV/0!"}]
[null,"totaal rantsoen",null,{"$f":"SUM(D3:D17)","v":0},{"$f":"SUM(E3:E17)","v":{"$error":"#DIV/0!"}}]
[]
[]
[]
[]
[null,"Voedermengwagen",null,"hoeveelheid (kg)",null,null,"hoeveelheid (kg) box:",null,"hoeveelheid"]
[null,null,null,"voedermengwagen","aandeel",null,"aantal dieren:",null,"(kg per dier)"]
[null,"voedermiddel 1:",null,null,{"$f":"D25/$D$40","v":{"$error":"#DIV/0!"}},null,null,null,{"$f":"E25*$H$40","v":{"$error":"#DIV/0!"}}]
[null,"voedermiddel 2:",null,null,{"$f":"D26/$D$40","v":{"$error":"#DIV/0!"}},null,null,null,{"$f":"E26*$H$40","v":{"$error":"#DIV/0!"}}]
[null,"voedermiddel 3:",null,null,{"$error":"#DIV/0!"},null,null,null,{"$error":"#DIV/0!"}]
[null,"voedermiddel 4:",null,null,{"$error":"#DIV/0!"},null,null,null,{"$error":"#DIV/0!"}]
[null,"voedermiddel 5:",null,null,{"$error":"#DIV/0!"},null,null,null,{"$error":"#DIV/0!"}]
[null,"voedermiddel 6:",null,null,{"$error":"#DIV/0!"},null,null,null,{"$error":"#DIV/0!"}]
[null,"voedermiddel 7:",null,null,{"$error":"#DIV/0!"},null,null,null,{"$error":"#DIV/0!"}]
[null,"voedermiddel 8:",null,null,{"$error":"#DIV/0!"},null,null,null,{"$error":"#DIV/0!"}]
[null,"voedermiddel 9:",null,null,{"$error":"#DIV/0!"},null,null,null,{"$error":"#DIV/0!"}]
[null,"voedermiddel 10:",null,null,{"$error":"#DIV/0!"},null,null,null,{"$error":"#DIV/0!"}]
[null,"voedermiddel 11:",null,null,{"$error":"#DIV/0!"},null,null,null,{"$error":"#DIV/0!"}]
[null,"voedermiddel 12:",null,null,{"$error":"#DIV/0!"},null,null,null,{"$error":"#DIV/0!"}]
[null,"voedermiddel 13:",null,null,{"$error":"#DIV/0!"},null,null,null,{"$error":"#DIV/0!"}]
[null,"voedermiddel 14:",null,null,{"$error":"#DIV/0!"},null,null,null,{"$error":"#DIV/0!"}]
[null,"voedermiddel 15:",null,null,{"$error":"#DIV/0!"},null,null,null,{"$error":"#DIV/0!"}]
[null,"totaal rantsoen",null,{"$f":"SUM(D25:D39)","v":0},{"$f":"SUM(E25:E39)","v":{"$error":"#DIV/0!"}},null,"totaal rantsoen",{"$f":"H23/H24","v":{"$error":"#DIV/0!"}},{"$f":"SUM(I25:I39)","v":{"$error":"#DIV/0!"}}]