{"text_format":"1","workbook":"xlsx","n_sheets":7,"sheets":["voederbehoeftenormen ","startpagina","vrouwelijk jongvee","zoogkoeien","stieren","lijst voedermiddelen","rekenblad"],"not_rendered":{"charts":0,"images":37,"macros":1,"external_links":0,"defined_names":17,"comments":4,"pivot_tables":0},"unopened":[],"bounds":{"document_bytes":16777216,"sheet_cells":100000,"rows_first":2000,"rows_last":500,"rows_between":2000,"halvings":0,"cell_chars":16384,"cell_head_chars":4096},"cells_cut":0,"cells_raw":0,"read":"whole","date_system":"1900"}

{"sheet":"voederbehoeftenormen ","index":0,"n_rows":116,"n_cols":16,"rows_kept":116,"cut":false,"hidden":true,"merged":[]}
["zoogkoeien",null,null,null,null,null,null,null,null,null,null,null,null,null,"kalving","fysiologische toestand"]
[null,"kalving","fysiologische toestand","VEM","DVE (g)","OEB (g)","Structuur (/kg DS)","Ca (g/kg DS)","P (g/kg DS)","Mg (g)","Na (g)","K (g)",null,null,"1e","niet-zogend"]
[null,"1e","niet-zogend",5473,146,-75,{"$f":"0.6*zoogkoeien!$D$67","v":0},{"$f":"7.6022+(0.9706*zoogkoeien!$D$67)","v":7.6021999999999998},{"$f":"(1.3867*zoogkoeien!$D$67)+1.2236","v":1.2236},8.1,null,null,null,null,"2e","hoogdrachtig (7m)"]
[null,"1e ","hoogdrachtig (7m)",6382.5,258,-75,{"$f":"0.6*zoogkoeien!$D$67","v":0},{"$f":"7.6022+(0.9706*zoogkoeien!$D$67)","v":7.6021999999999998},{"$f":"(1.3867*zoogkoeien!$D$67)+1.2236","v":1.2236},9.1,null,null,null,null,"3e of meer","hoogdrachtig (8m)"]
[null,"1e","hoogdrachtig (8m)",7077.5,339,-75,{"$f":"0.6*zoogkoeien!$D$67","v":0},{"$f":"17.01397+(0.9706*zoogkoeien!$D$67)","v":17.01397},{"$f":"(1.3867*zoogkoeien!$D$67)+6.6903","v":6.6902999999999997},9,null,null,null,null,null,"hoogdrachtig (9m)"]
[null,"1e","hoogdrachtig (9m)",8362.5,446,-75,{"$f":"0.6*zoogkoeien!$D$67","v":0},{"$f":"21.2787+(0.9706*zoogkoeien!$D$67)","v":21.278700000000001},{"$f":"(1.3867*zoogkoeien!$D$67)+8.0236","v":8.0236000000000001},9.5,null,null,null,null,null,"zogend"]
[null,"1e","zogend",8125,458,0,{"$f":"0.7*zoogkoeien!$D$67","v":0},{"$f":"18.1904+(0.9706*zoogkoeien!$D$67)","v":18.1904},{"$f":"(1.08*zoogkoeien!$D$67)+9.2236","v":9.2235999999999994},10.7]
[null,"2e","niet-zogend",5956,154,-94,{"$f":"0.6*zoogkoeien!$D$67","v":0},{"$f":"8.4097+(0.9706*zoogkoeien!$D$67)","v":8.4097000000000008},{"$f":"(1.3867*zoogkoeien!$D$67)+1.1963","v":1.1962999999999999},9.1999999999999993]
[null,"2e","hoogdrachtig (7m)",6866.25,265.5,-94,{"$f":"0.6*zoogkoeien!$D$67","v":0},{"$f":"8.4097+(0.9706*zoogkoeien!$D$67)","v":8.4097000000000008},{"$f":"(1.3867*zoogkoeien!$D$67)+1.1963","v":1.1962999999999999},10.199999999999999]
[null,"2e","hoogdrachtig (8m)",7561.25,346.5,-94,{"$f":"0.6*zoogkoeien!$D$67","v":0},{"$f":"17.8215+(0.9706*zoogkoeien!$D$67)","v":17.8215},{"$f":"(1.3867*zoogkoeien!$D$67)+6.6629","v":6.6628999999999996},10]
{"$rows_left_out":107}
{"sheet":"startpagina","index":1,"n_rows":0,"n_cols":0,"rows_kept":0,"cut":false,"hidden":false,"merged":[]}

{"sheet":"vrouwelijk jongvee","index":2,"n_rows":105,"n_cols":12,"rows_kept":105,"cut":false,"hidden":false,"merged":[[79,3,79,4],[80,3,80,4],[81,3,81,4],[82,3,82,4],[65,1,65,2],[66,1,66,2],[76,3,76,4],[77,3,77,4]]}
[]
[null,"vrouwelijk jongvee"]
[]
[null,null,null,null,null,null,null,null,null,null,"energieprijs en eiwittoeslagprijs (in eurocenten)"]
[null,"voedermiddelen",null,null,null,null,null,null,null,null,"per kVEM",0]
[null,null,null,null,null,null,null,null,null,null,"per kg DVE-toeslag",0]
[null,null,null,null,null,null,null,null,null,null,"datum"]
[null,null,"soort voedermiddel","DS                (g DS/kg VS)","VEM                  (/kg DS)","VEVI                         (/kg DS)","DVE                             (g/kg DS)","OEB                         (g/kg DS)","RE                          (g/kg DS)",null,"kostprijs voeder-middel (€/ton VS)","voederwaardeprijs (€/ton VS)"]
[null,"voedermiddel1","(voedermiddel)",{"$f":"VLOOKUP('vrouwelijk jongvee'!$C9,'lijst voedermiddelen'!$B$2:$N$198,2,FALSE)","v":0},{"$f":"VLOOKUP('vrouwelijk jongvee'!$C9,'lijst voedermiddelen'!$B$2:$N$198,3,FALSE)","v":0},{"$f":"VLOOKUP('vrouwelijk jongvee'!$C9,'lijst voedermiddelen'!$B$2:$N$198,4,FALSE)","v":0},{"$f":"VLOOKUP('vrouwelijk jongvee'!$C9,'lijst voedermiddelen'!$B$2:$N$198,5,FALSE)","v":0},{"$f":"VLOOKUP('vrouwelijk jongvee'!$C9,'lijst voedermiddelen'!$B$2:$N$198,6,FALSE)","v":0},{"$f":"VLOOKUP('vrouwelijk jongvee'!$C9,'lijst voedermiddelen'!$B$2:$N$198,7,FALSE)","v":0},null,0,{"$f":"IFERROR((VLOOKUP('vrouwelijk jongvee'!C9,'lijst voedermiddelen'!$B$2:$P$198,2,FALSE)/1000)*(((L$5*VLOOKUP('vrouwelijk jongvee'!C9,'lijst voedermiddelen'!$B$2:$P$198,3,FALSE))+(L$6*VLOOKUP('vrouwelijk jongvee'!$C9,'lijst voedermiddelen'!$B$2:$P$198,5,FALSE)))/1000)*(1-VLOOKUP('vrouwelijk jongvee'!$C9,'lijst voedermiddelen'!$B$2:$P$198,15,FALSE)/100)*10,\"-\")","v":0}]
[null,"voedermiddel2","(voedermiddel)",{"$f":"VLOOKUP('vrouwelijk jongvee'!$C10,'lijst voedermiddelen'!$B$2:$N$198,2,FALSE)","v":0},{"$f":"VLOOKUP('vrouwelijk jongvee'!$C10,'lijst voedermiddelen'!$B$2:$N$198,3,FALSE)","v":0},{"$f":"VLOOKUP('vrouwelijk jongvee'!$C10,'lijst voedermiddelen'!$B$2:$N$198,4,FALSE)","v":0},{"$f":"VLOOKUP('vrouwelijk jongvee'!$C10,'lijst voedermiddelen'!$B$2:$N$198,5,FALSE)","v":0},{"$f":"VLOOKUP('vrouwelijk jongvee'!$C10,'lijst voedermiddelen'!$B$2:$N$198,6,FALSE)","v":0},{"$f":"VLOOKUP('vrouwelijk jongvee'!$C10,'lijst voedermiddelen'!$B$2:$N$198,7,FALSE)","v":0},null,0,{"$f":"IFERROR((VLOOKUP('vrouwelijk jongvee'!C10,'lijst voedermiddelen'!$B$2:$P$198,2,FALSE)/1000)*(((L$5*VLOOKUP('vrouwelijk jongvee'!C10,'lijst voedermiddelen'!$B$2:$P$198,3,FALSE))+(L$6*VLOOKUP('vrouwelijk jongvee'!$C10,'lijst voedermiddelen'!$B$2:$P$198,5,FALSE)))/1000)*(1-VLOOKUP('vrouwelijk jongvee'!$C10,'lijst voedermiddelen'!$B$2:$P$198,15,FALSE)/100)*10,\"-\")","v":0}]
{"$rows_left_out":96}
{"sheet":"zoogkoeien","index":3,"n_rows":105,"n_cols":12,"rows_kept":105,"cut":false,"hidden":false,"merged":[[82,3,82,4],[76,3,76,4],[77,3,77,4],[79,3,79,4],[80,3,80,4],[81,3,81,4]]}
[]
[null,"zoogkoeien"]
[]
[null,null,null,null,null,null,null,null,null,null,"energieprijs en eiwittoeslagprijs (in eurocenten)"]
[null,"voedermiddelen",null,null,null,null,null,null,null,null,"per kVEM",0]
[null,null,null,null,null,null,null,null,null,null,"per kg DVE-toeslag",0]
[null,null,null,null,null,null,null,null,null,null,"datum"," "]
[null,null,"soort voedermiddel","DS                   (g DS/kg VS)","VEM               (/kg DS)","VEVI                           (/kg DS)","DVE                  (g/kg DS)","OEB               (g/kg DS)","RE                  (g/kg DS)",null,"kostprijs voeder-middel (€/ton VS)","voederwaardeprijs (€/ton VS)"]
[null,"voedermiddel1","(voedermiddel)",{"$f":"VLOOKUP(zoogkoeien!$C9,'lijst voedermiddelen'!$B$2:$N$198,2,FALSE)","v":0},{"$f":"VLOOKUP(zoogkoeien!$C9,'lijst voedermiddelen'!$B$2:$N$198,3,FALSE)","v":0},{"$f":"VLOOKUP(zoogkoeien!$C9,'lijst voedermiddelen'!$B$2:$N$198,4,FALSE)","v":0},{"$f":"VLOOKUP(zoogkoeien!$C9,'lijst voedermiddelen'!$B$2:$N$198,5,FALSE)","v":0},{"$f":"VLOOKUP(zoogkoeien!$C9,'lijst voedermiddelen'!$B$2:$N$198,6,FALSE)","v":0},{"$f":"VLOOKUP(zoogkoeien!$C9,'lijst voedermiddelen'!$B$2:$N$198,7,FALSE)","v":0},null,0,{"$f":"IFERROR((VLOOKUP(zoogkoeien!$C9,'lijst voedermiddelen'!$B$2:$P$198,2,FALSE)/1000)*(((L$5*VLOOKUP(zoogkoeien!$C9,'lijst voedermiddelen'!$B$2:$P$198,3,FALSE))+(L$6*VLOOKUP(zoogkoeien!$C9,'lijst voedermiddelen'!$B$2:$P$198,5,FALSE)))/1000)*(1-VLOOKUP(zoogkoeien!$C9,'lijst voedermiddelen'!$B$2:$P$198,15,FALSE)/100)*10,\"-\")","v":0}]
[null,"voedermiddel2","(voedermiddel)",{"$f":"VLOOKUP(zoogkoeien!$C10,'lijst voedermiddelen'!$B$2:$N$198,2,FALSE)","v":0},{"$f":"VLOOKUP(zoogkoeien!$C10,'lijst voedermiddelen'!$B$2:$N$198,3,FALSE)","v":0},{"$f":"VLOOKUP(zoogkoeien!$C10,'lijst voedermiddelen'!$B$2:$N$198,4,FALSE)","v":0},{"$f":"VLOOKUP(zoogkoeien!$C10,'lijst voedermiddelen'!$B$2:$N$198,5,FALSE)","v":0},{"$f":"VLOOKUP(zoogkoeien!$C10,'lijst voedermiddelen'!$B$2:$N$198,6,FALSE)","v":0},{"$f":"VLOOKUP(zoogkoeien!$C10,'lijst voedermiddelen'!$B$2:$N$198,7,FALSE)","v":0},null,0,{"$f":"IFERROR((VLOOKUP(zoogkoeien!$C10,'lijst voedermiddelen'!$B$2:$P$198,2,FALSE)/1000)*(((L$5*VLOOKUP(zoogkoeien!$C10,'lijst voedermiddelen'!$B$2:$P$198,3,FALSE))+(L$6*VLOOKUP(zoogkoeien!$C10,'lijst voedermiddelen'!$B$2:$P$198,5,FALSE)))/1000)*(1-VLOOKUP(zoogkoeien!$C10,'lijst voedermiddelen'!$B$2:$P$198,15,FALSE)/100)*10,\"-\")","v":0}]
{"$rows_left_out":96}
{"sheet":"stieren","index":4,"n_rows":106,"n_cols":13,"rows_kept":106,"cut":false,"hidden":false,"merged":[[82,3,82,4],[76,3,76,4],[77,3,77,4],[79,3,79,4],[80,3,80,4],[81,3,81,4]]}
[]
[null,"stieren"]
[]
[null,null,null,null,null,null,null,null,null,null,"energieprijs en eiwittoeslagprijs (in eurocenten)"]
[null,"voedermiddelen",null,null,null,null,null,null,null,null,"per kVEVI",0]
[null,null,null,null,null,null,null,null,null,null,"per kg DVE-toeslag",0]
[null,null,null,null,null,null,null,null,null,null,"datum"]
[null,null,"soort voedermiddel","DS                 (g DS/kg VS)","VEM                          (/kg DS)","VEVI                      (/kg DS)","DVE                       (g/kg DS)","OEB                  (g/kg DS)","RE                   (g/kg DS)",null,"kostprijs voeder-middel (€/ton VS)","voederwaardeprijs (€/ton VS)"]
[null,"voedermiddel1","(voedermiddel)",{"$f":"VLOOKUP(stieren!$C9,'lijst voedermiddelen'!$B$2:$N$198,2,FALSE)","v":0},{"$f":"VLOOKUP(stieren!$C9,'lijst voedermiddelen'!$B$2:$N$198,3,FALSE)","v":0},{"$f":"VLOOKUP(stieren!$C9,'lijst voedermiddelen'!$B$2:$N$198,4,FALSE)","v":0},{"$f":"VLOOKUP(stieren!$C9,'lijst voedermiddelen'!$B$2:$N$198,5,FALSE)","v":0},{"$f":"VLOOKUP(stieren!$C9,'lijst voedermiddelen'!$B$2:$N$198,6,FALSE)","v":0},{"$f":"VLOOKUP(stieren!$C9,'lijst voedermiddelen'!$B$2:$N$198,7,FALSE)","v":0},null,0,{"$f":"IFERROR((VLOOKUP(stieren!C9,'lijst voedermiddelen'!$B$2:$P$198,2,FALSE)/1000)*(((L$5*VLOOKUP(stieren!C9,'lijst voedermiddelen'!$B$2:$P$198,4,FALSE))+(L$6*VLOOKUP(stieren!$C9,'lijst voedermiddelen'!$B$2:$P$198,5,FALSE)))/1000)*(1-VLOOKUP(stieren!$C9,'lijst voedermiddelen'!$B$2:$P$198,15,FALSE)/100)*10,\"-\")","v":0}]
[null,"voedermiddel2","(voedermiddel)",{"$f":"VLOOKUP(stieren!$C10,'lijst voedermiddelen'!$B$2:$N$198,2,FALSE)","v":0},{"$f":"VLOOKUP(stieren!$C10,'lijst voedermiddelen'!$B$2:$N$198,3,FALSE)","v":0},{"$f":"VLOOKUP(stieren!$C10,'lijst voedermiddelen'!$B$2:$N$198,4,FALSE)","v":0},{"$f":"VLOOKUP(stieren!$C10,'lijst voedermiddelen'!$B$2:$N$198,5,FALSE)","v":0},{"$f":"VLOOKUP(stieren!$C10,'lijst voedermiddelen'!$B$2:$N$198,6,FALSE)","v":0},{"$f":"VLOOKUP(stieren!$C10,'lijst voedermiddelen'!$B$2:$N$198,7,FALSE)","v":0},null,0,{"$f":"IFERROR((VLOOKUP(stieren!C10,'lijst voedermiddelen'!$B$2:$P$198,2,FALSE)/1000)*(((L$5*VLOOKUP(stieren!C10,'lijst voedermiddelen'!$B$2:$P$198,4,FALSE))+(L$6*VLOOKUP(stieren!$C10,'lijst voedermiddelen'!$B$2:$P$198,5,FALSE)))/1000)*(1-VLOOKUP(stieren!$C10,'lijst voedermiddelen'!$B$2:$P$198,15,FALSE)/100)*10,\"-\")","v":0}]
{"$rows_left_out":97}
{"sheet":"lijst voedermiddelen","index":5,"n_rows":53,"n_cols":16,"rows_kept":53,"cut":false,"hidden":true,"merged":[]}
["Nr.","voedermiddel","DS  (g/kg VS)","VEM (/kg DS)","VEVI (/kg DS)","DVE (g/kg DS)","OEB (g/kg DS)","RE (g/kgDS)","SW (/kg DS)","Ca (g/kg DS)","P (g/kg DS)","Mg (g/kg DS)","Na (g/kg DS)","K (g/kg DS)","VW (/kg DS)","bewaarverliezen (%)"]
[{"$f":"ROW(A1)","v":1},"(voedermiddel)"]
[2,"aardappelen, vers ",199,1108,1226,69,-14,104,0.7,1.45,2.65,1.2,1.8,23.55,0.65,5]
[3,"aardappelsnippers",296,1227,1359,71,-25,92,0.48,0.46,2.02,0.48,1.25,12,0.56999999999999995,7]
[4,"aardappelstoomschillen",134,1099,1206,101,-22,132,0.45,1.56,2.68,1.1599999999999999,0.91,28.36,0.51,5]
[5,"bietenmelasse",725,1043,1152,74,78,142,-0.25,5.75,0.38,0.28000000000000003,7.76,59.9,0.34,0]
[6,"bietenvinasse",674,912,984,46,248,352,0.09,6.13,1.77,1.51,25.04,94,0.32,0]
[7,"CCM RC 40-60g/kg",593,1178,1294,80,-39,98,0.5,0.13,3.3,1.2,0.1,4.0999999999999996,0.71,5]
[8,"cichoreipulp",884,1023,1100,96,-68,90,0.28000000000000003,10.07,2.0099999999999998,1.47,1.73,9.99,0.43,0]
[9,"citruspulp",904,1068,1165,84,-73,69,0.2,13.33,1.33,1.38,0.55000000000000004,10.46,0.34,0]
{"$rows_left_out":44}
{"sheet":"rekenblad","index":6,"n_rows":40,"n_cols":9,"rows_kept":40,"cut":false,"hidden":false,"merged":[]}
[null,"box:",null,"hoeveelheid (kg)"]
[null,"aantal dieren:",null,"voor alle dieren","per dier"]
[null,"voedermiddel 1:",null,null,{"$f":"D3/$C$2","v":{"$error":"#DIV/0!"}}]
[null,"voedermiddel 2:",null,null,{"$f":"D4/$C$2","v":{"$error":"#DIV/0!"}}]
[null,"voedermiddel 3:",null,null,{"$f":"D5/$C$2","v":{"$error":"#DIV/0!"}}]
[null,"voedermiddel 4:",null,null,{"$f":"D6/$C$2","v":{"$error":"#DIV/0!"}}]
[null,"voedermiddel 5:",null,null,{"$f":"D7/$C$2","v":{"$error":"#DIV/0!"}}]
[null,"voedermiddel 6:",null,null,{"$error":"#DIV/0!"}]
[null,"voedermiddel 7:",null,null,{"$error":"#DIV/0!"}]
[null,"voedermiddel 8:",null,null,{"$error":"#DIV/0!"}]
{"$rows_left_out":30}